{"text_format":"1","workbook":"xlsx","n_sheets":20,"sheets":["Teilnehmer Erfassung","Original","Auswertung Runde 1","Runde 1","Teilnehmer 2.Runde","Runde 2","Auswertung Runde 2","Teilnehmer 3.Runde","Runde 3","Auswertung Runde 3","Teilnehmer 4.Runde","Runde 4","Auswertung Runde 4","Teilnehmer 5.Runde","Runde 5","Auswertung Runde 5","Teilnehmer 6.Runde","Runde 6","Kopie Teilnehmer Erfassung","Finale Kinder unter 13 Jahren"],"not_rendered":{"charts":0,"images":0,"macros":1,"external_links":0,"defined_names":31,"comments":0,"pivot_tables":0},"unopened":[],"bounds":{"document_bytes":16777216,"sheet_cells":100000,"rows_first":2000,"rows_last":500,"rows_between":2000,"halvings":0,"cell_chars":16384,"cell_head_chars":4096},"cells_cut":0,"cells_raw":0,"read":"whole","date_system":"1904"}

{"sheet":"Teilnehmer Erfassung","index":0,"n_rows":106,"n_cols":30,"rows_kept":106,"cut":false,"hidden":false,"merged":[[3,13,3,16],[3,8,3,10]]}
[null,null,null,null,null,null,null,null,null,null,"1.Runde",null,null,"2.Runde",null,null,"3.Runde",null,null,"4.Runde",null,null,"5.Runde",null,null,"6.Runde"]
[null,null,null,null,null,null,null,null,null,"Teilnehmerzahl:",{"$f":"IF(AND(J7=\"\",J8=\"\",J9=\"\",J10=\"\"),\"Es sind keine Teilnehmer erfasst\",IF(AND(J7=\"\",OR(J8>\"\",J9>\"\",J10>\"\")),AD16,IF(OR(J8=\"\",J9=\"\",J10=\"\"),AD16,IF(AND(J11=\"\",J12=\"\",J13=\"\",J14=\"\"),4,IF(AND(J11=\"\",OR(J12>\"\",J13>\"\",J14>\"\")),AD17,IF(OR(J12=\"\",J13=\"\",J14=\"\"),AD17,IF(AND(J15=\"\",J16=\"\",J17=\"\",J18=\"\"),8,IF(AND(J15=\"\",OR(J16>\"\",J17>\"\",J18>\"\")),AD18,IF(OR(J16=\"\",J17=\"\",J18=\"\"),AD18,IF(AND(J19=\"\",J20=\"\",J21=\"\",J22=\"\"),12,IF(AND(J19=\"\",OR(J20>\"\",J21>\"\",J22>\"\")),AD19,IF(OR(J20=\"\",J21=\"\",J22=\"\"),AD19,IF(AND(J23=\"\",J24=\"\",J25=\"\",J26=\"\"),16,IF(AND(J23=\"\",OR(J24>\"\",J25>\"\",J26>\"\")),AD20,IF(OR(J24=\"\",J25=\"\",J26=\"\"),AD20,IF(AND(J27=\"\",J28=\"\",J29=\"\",J30=\"\"),20,IF(AND(J27=\"\",OR(J28>\"\",J29>\"\",J30>\"\")),AD21,IF(OR(J28=\"\",J29=\"\",J30=\"\"),AD21,IF(AND(J31=\"\",J32=\"\",J33=\"\",J34=\"\"),24,IF(AND(J31=\"\",OR(J32>\"\",J33>\"\",J34>\"\")),AD22,IF(OR(J32=\"\",J33=\"\",J34=\"\"),AD22,IF(AND(J35=\"\",J36=\"\",J37=\"\",J38=\"\"),28,IF(AND(J35=\"\",OR(J36>\"\",J37>\"\",J38>\"\")),AD23,IF(AND(J39=\"\",J40=\"\",J41=\"\",J42=\"\"),32,IF(AND(J39=\"\",OR(J40>\"\",J41>\"\",J42>\"\")),AD24,IF(OR(J40=\"\",J41=\"\",J42=\"\"),AD24,IF(AND(J43=\"\",J44=\"\",J45=\"\",J46=\"\"),36,IF(AND(J37=\"\",OR(J38>\"\",J39>\"\",J40>\"\")),AD25,IF(OR(J44=\"\",J45=\"\",J46=\"\"),AD25,IF(AND(J47=\"\",J48=\"\",J49=\"\",J50=\"\"),40,IF(AND(J47=\"\",OR(J48>\"\",J49>\"\",J50>\"\")),AD26,IF(OR(J48=\"\",J49=\"\",J50=\"\"),AD26,IF(AND(J51=\"\",J52=\"\",J53=\"\",J54=\"\"),44,IF(AND(J51=\"\",OR(J52>\"\",J53>=\"\",J54>\"\")),AD27,IF(OR(J52=\"\",J53=\"\",J54=\"\"),AD27,IF(AND(J55=\"\",J56=\"\",J57=\"\",J58=\"\"),48,IF(AND(J55=\"\",OR(J56>\"\",J57>\"\",J58>\"\")),AD28,IF(OR(J56=\"\",J57=\"\",J58=\"\"),AD28,IF(AND(J59=\"\",J60=\"\",J61=\"\",J62=\"\"),52,IF(AND(J59=\"\",OR(J60>\"\",J61>\"\",J62>\"\")),AD29,IF(OR(J60=\"\",J61=\"\",J62=\"\"),AD29,IF(J62=\"\",AD29,IF(AND(J63=\"\",J64=\"\",J65=\"\",J66=\"\"),56,IF(AND(J63=\"\",OR(J64>\"\",J65>\"\",J66>\"\")),AD30,IF(OR(J64=\"\",J65=\"\",J66=\"\"),AD30,IF(AND(J67=\"\",J68=\"\",J69=\"\",J70=\"\"),60,IF(AND(J67=\"\",OR(J68>\"\",J69>\"\",J70>\"\")),AD31,IF(OR(J68=\"\",J69=\"\",J70=\"\"),AD31,IF(AND(J71=\"\",J72=\"\",J73=\"\",J74=\"\"),64,IF(AND(J71=\"\",OR(J72>\"\",J73>\"\",J74>\"\")),AD32,IF(OR(J72=\"\",J73=\"\",J74=\"\"),AD32,IF(AND(J75=\"\",J76=\"\",J77=\"\",J78=\"\"),68,IF(AND(J75=\"\",OR(J76>\"\",J77>\"\",J78>\"\")),AD33,IF(OR(J76=\"\",J77=\"\",J78=\"\"),AD33,IF(AND(J79=\"\",J80=\"\",J81=\"\",J82=\"\"),72,IF(AND(J79=\"\",OR(J80>\"\",J81>\"\",J82>\"\")),AD34,IF(OR(J80=\"\",J81=\"\",J82=\"\"),AD34,IF(AND(J83=\"\",J84=\"\",J85=\"\",J86=\"\"),76,IF(AND(J83=\"\",OR(J84>\"\",J85>\"\",J86>\"\")),AD35,IF(OR(J84=\"\",J85=\"\",J86=\"\"),AD35,IF(AND(J87=\"\",J88=\"\",J89=\"\",J90=\"\"),80,IF(AND(J87=\"\",OR(J88>\"\",J89>\"\",J90>\"\")),AD36,IF(OR(J88=\"\",J89=\"\",J90=\"\"),AD36,Z4)))))))))))))))))))))))))))))))))))))))))))))))))))))))))))))))","v":"Es sind keine Teilnehmer erfasst"},{"$f":"ROUNDUP(K2/2,0)","v":{"$error":"#VALUE!"}},{"$f":"L2/4","v":{"$error":"#VALUE!"}},{"$f":"IFERROR(IF(K2<=4,0,((ROUNDUP(M2,0)*4)+N3)),\"\")","v":""},{"$f":"ROUNDUP(N2/2,0)","v":{"$error":"#VALUE!"}},{"$f":"O2/4","v":{"$error":"#VALUE!"}},{"$f":"IFERROR(IF(N2<=4,0,((ROUNDUP(P2,0)*4)+Q3)),\"\")","v":""},{"$f":"ROUNDUP(Q2/2,0)","v":{"$error":"#VALUE!"}},{"$f":"R2/4","v":{"$error":"#VALUE!"}},{"$f":"IFERROR(IF(Q2<=4,0,ROUNDUP(S2,0)*4),\"\")","v":""},{"$f":"ROUNDUP(T2/2,0)","v":{"$error":"#VALUE!"}},{"$f":"U2/4","v":{"$error":"#VALUE!"}},{"$f":"IFERROR(IF(T2<=4,0,ROUNDUP(V2,0)*4),\"\")","v":""},{"$f":"ROUNDUP(W2/2,0)","v":{"$error":"#VALUE!"}},{"$f":"SUM(X2/4)","v":{"$error":"#VALUE!"}},{"$f":"IFERROR(IF(W2<=4,0,ROUNDUP(Y2,0)*4),\"\")","v":""},null,0]
[null,null,null,null,null,null,null,null,null,null,"Rundenkorrektur",null,null,0,0,0,0,null,null,null,null,null,null,null,null,"Kinderfinale Alter ab:",10,4]
[null,null,null,null,null,null,null,null,"Info: Vornamen müssen pro Spieler immer eingetragen werden !!!!",null,null,null,null,{"$f":"IF(K2=\"Es sind keine Teilnehmer erfasst\",\"Es sind keine Teilnehmer erfasst\",IF(ISTEXT(K2),\"Mindest Spielerzahl nicht eingetragen. Ggf. bis zu 3 PSEUDO-Spielernamen beim Vornamen eintragen\",IF(AND(K2=4,SUM(Z11:AC106)>0),\"Bitte alte / unvollständige Daten von Spieler 5 bis 100 löschen. Spieler müssen immer ohne Lücke in die Liste von                  1 bis … eingetragen werden!!!\",IF(AND(K2=8,SUM(Z15:AC106)>0),\"Bitte alte / unvollständige Daten von Spieler 9 bis 100 löschen. Spieler müssen immer ohne Lücke in die Liste von              1 bis … eingetragen werden!!!\",IF(AND(K2=12,SUM(Z19:AC106)>0),\"Bitte alte / unvollständige Daten von Spieler 13 bis 100 löschen. Spieler müssen immer ohne Lücke in die Liste von                    1 bis … eingetragen werden!!!\",IF(AND(K2=16,SUM(Z23:AC106)>0),\"Bitte alte / unvollständige Daten von Spieler 17 bis 100 löschen. Spieler müssen immer ohne Lücke in die Liste von                   1 bis … eingetragen werden!!!\",IF(AND(K2=20,SUM(Z27:AC106)>0),\"Bitte alte / unvollständige Daten von Spieler 21 bis 100 löschen. Spieler müssen immer ohne Lücke in die Liste von                   1 bis … eingetragen werden!!!\",IF(AND(K2=24,SUM(Z31:AC106)>0),\"Bitte alte / unvollständige Daten von Spieler 25 bis 100 löschen. Spieler müssen immer ohne Lücke in die Liste von                   1 bis … eingetragen werden!!!\",IF(AND(K2=28,SUM(Z35:AC106)>0),\"Bitte alte / unvollständige Daten von Spieler 29 bis 100 löschen. Spieler müssen immer ohne Lücke in die Liste von                   1 bis … eingetragen werden!!!\",IF(AND(K2=32,SUM(Z39:AC106)>0),\"Bitte alte / unvollständige Daten von Spieler 33 bis 100 löschen. Spieler müssen immer ohne Lücke in die Liste von                  1 bis … eingetragen werden!!!\",IF(AND(K2=36,SUM(Z43:AC6106)>0),\"Bitte alte / unvollständige Daten für von Spieler 37 bis 100 löschen. Spieler müssen immer ohne Lücke in die Liste von                       1 bis … eingetragen werden!!!\",IF(AND(K2=40,SUM(Z47:AC106)>0),\"Bitte alte / unvollständige Daten von Spieler 41 bis 100 löschen. Spieler müssen immer ohne Lücke in die Liste von                   1 bis … eingetragen werden!!!\",IF(AND(K2=44,SUM(Z51:AC106)>0),\"Bitte alte / unvollständige Daten von Spieler 45 bis 100 löschen. Spieler müssen immer ohne Lücke in die Liste von                   1 bis … eingetragen werden!!!\",IF(AND(K2=48,SUM(Z55:AC106)>0),\"Bitte alte / unvollständige Daten von Spieler 49 bis 100 löschen. Spieler müssen immer ohne Lücke in die Liste von                      1 bis … eingetragen werden!!!\",IF(AND(K2=52,SUM(Z59:AC6106)>0),\"Bitte alte / unvollständige Daten von Spieler 53 bis 100 löschen. Spieler müssen immer ohne Lücke in die Liste von                    1 bis … eingetragen werden!!!\",IF(AND(K2=56,SUM(Z63:AC106)>0),\"Bitte alte / unvollständige Daten von Spieler 57 bis 100 löschen. Spieler müssen immer ohne Lücke in die Liste von                    1 bis … eingetragen werden!!!\",IF(AND(K2=60,SUM(Z67:AC106)>0),\"Bitte alte / unvollständige Daten von Spieler 61 bis 100 löschen. Spieler müssen immer ohne Lücke in die Liste von                    1 bis … eingetragen werden!!!\",IF(AND(K2=64,SUM(Z71:AC106)>0),\"Bitte alte / unvollständige Daten von Spieler 65 bis 100 löschen. Spieler müssen immer ohne Lücke in die Liste von                    1 bis … eingetragen werden!!!\",IF(AND(K2=68,SUM(Z75:AC106)>0),\"Bitte alte / unvollständige Daten von Spieler 69 bis 100 löschen. Spieler müssen immer ohne Lücke in die Liste von                    1 bis … eingetragen werden!!!\",IF(AND(K2=72,SUM(Z79:AC106)>0),\"Bitte alte / unvollständige Daten von Spieler 73 bis 100 löschen. Spieler müssen immer ohne Lücke in die Liste von                    1 bis … eingetragen werden!!!\",IF(AND(K2=76,SUM(Z83:AC106)>0),\"Bitte alte / unvollständige Daten von Spieler 77 bis 100 löschen. Spieler müssen immer ohne Lücke in die Liste von                    1 bis … eingetragen werden!!!\",IF(AND(K2=80,SUM(Z87:AC106)>0),\"Bitte alte / unvollständige Daten von Spieler 81 bis 100 löschen. Spieler müssen immer ohne Lücke in die Liste von                    1 bis … eingetragen werden!!!\",IF(AND(K2=84,SUM(Z91:AC106)>0),\"Bitte alte / unvollständige Daten von Spieler 85 bis 100 löschen. Spieler müssen immer ohne Lücke in die Liste von                    1 bis … eingetragen werden!!!\",IF(AND(K2=88,SUM(Z95:AC106)>0),\"Bitte alte / unvollständige Daten von Spieler 89 bis 100 löschen. Spieler müssen immer ohne Lücke in die Liste von                    1 bis … eingetragen werden!!!\",IF(AND(K2=92,SUM(Z99:AC106)>0),\"Bitte alte / unvollständige Daten von Spieler 93 bis 100 löschen. Spieler müssen immer ohne Lücke in die Liste von                    1 bis … eingetragen werden!!!\",IF(AND(K2=96,SUM(Z103:AC106)>0),\"Bitte alte / unvollständige Daten von Spieler 97 bis 100 löschen. Spieler müssen immer ohne Lücke in die Liste von                    1 bis … eingetragen werden!!!\",\"Eingabe o.k.\"))))))))))))))))))))))))))","v":"Es sind keine Teilnehmer erfasst"},null,null,null,null,null,"1.Runde starten >",null,null,null,null,null,{"$f":"IF(AND(J91=\"\",J92=\"\",J93=\"\",J94=\"\"),84,IF(AND(J91=\"\",OR(J92>\"\",J93>\"\",J94>\"\")),AD37,IF(OR(J92=\"\",J93=\"\",J94=\"\"),AD37,IF(AND(J95=\"\",J96=\"\",J97=\"\",J98=\"\"),88,IF(AND(J95=\"\",OR(J96>\"\",J97>\"\",J98>\"\")),AD38,IF(OR(J96=\"\",J97=\"\",J98=\"\"),AD38,IF(AND(J99=\"\",J100=\"\",J101=\"\",J102=\"\"),92,IF(AND(J99=\"\",OR(J100>\"\",J101>\"\",J102>\"\")),AD39,IF(OR(J100=\"\",J101=\"\",J102=\"\"),AD39,IF(AND(J103=\"\",J104=\"\",J105=\"\",J106=\"\"),96,IF(AND(J103=\"\",OR(J104>\"\",J105>\"\",J106>\"\")),AD40,IF(OR(J104=\"\",J105=\"\",J106=\"\"),AD40,100))))))))))))","v":84}]
[null,null,null,null,null,null,null,null,null,null,null,null,null,null,null,null,null,null,null,null,null,null,null,null,null,{"$f":"IF(N4=\"Eingabe o.k.\",1,\"\")","v":""}]
[null,null,"Nr.:",null,null,null,null,null,"Nr.:","Vorname","Name",null,null,"Alter",null,null,"E-Mail Adresse"]
[{"$f":"RAND()","v":5.2201821340843946E-2},{"$f":"RANK(A7,$A$7:$A$106)","v":96},{"$f":"B7","v":96},null,null,null,null,null,1,null,null,null,null,null,null,null,null,null,null,null,null,null,null,null,null,{"$f":"IF(K7>\"\",1,0)","v":0},{"$f":"IF(J7>\"\",1,0)","v":0},{"$f":"IF(K7>\"\",1,0)","v":0},{"$f":"IF(N7>\"\",1,0)","v":0}]
[{"$f":"RAND()","v":0.54065525670740833},48,{"$f":"B8","v":48},null,null,null,null,null,2,null,null,null,null,null,null,null,null,null,null,null,null,null,null,null,null,0,{"$f":"IF(J8>\"\",1,0)","v":0},{"$f":"IF(N8>\"\",1,0)","v":0},{"$f":"IF(Q8>\"\",1,0)","v":0}]
[0.44585114173095264,58,58,null,null,null,null,null,3,null,null,null,null,null,null,null,null,null,null,null,null,null,null,null,null,0,0,0,0]
[0.73624967639753214,23,23,null,null,null,null,null,4,null,null,null,null,null,null,null,null,null,null,null,null,null,null,null,null,0,0,0,0]
[0.71161246403730949,28,28,null,null,null,null,null,5,null,null,null,null,null,null,null,null,null,null,null,null,null,null,null,null,0,0,0,0]
[6.3573594212945284E-2,95,95,null,null,null,null,null,6,null,null,null,null,null,null,null,null,null,null,null,null,null,null,null,null,0,0,0,0]
[0.30992507302175798,76,76,null,null,null,null,null,7,null,null,null,null,null,null,null,null,null,null,null,null,null,null,null,null,0,0,0,0]
[0.88410276753034012,9,9,null,null,null,null,null,8,null,null,null,null,null,null,null,null,null,null,null,null,null,null,null,null,0,0,0,0]
[0.59800631187630837,37,37,null,null,null,null,null,9,null,null,null,null,null,null,null,null,null,null,null,null,null,null,null,null,0,0,0,0]
[0.11571908842026524,90,90,null,null,null,null,null,10,null,null,null,null,null,null,null,null,null,null,null,null,null,null,null,null,0,0,0,0,"Bitte mindestens 4 Teilnehmer eintragen. "]
[0.49565970699736239,54,54,null,null,null,null,null,11,null,null,null,null,null,null,null,null,null,null,null,null,null,null,null,null,0,0,0,0,"Bitte mindestens 8 Teilnehmer eintragen. "]
[0.43882974247876771,59,59,null,null,null,null,null,12,null,null,null,null,null,null,null,null,null,null,null,null,null,null,null,null,0,0,0,0,"Bitte mindestens 12 Teilnehmer eintragen."]
[0.29444460683413498,78,78,null,null,null,null,null,13,null,null,null,null,null,null,null,null,null,null,null,null,null,null,null,null,0,0,0,0,"Bitte mindestens 16 Teilnehmer eintragen. "]
[0.6959255325741811,29,29,null,null,null,null,null,14,null,null,null,null,null,null,null,null,null,null,null,null,null,null,null,null,0,0,0,0,"Bitte mindestens 20 Teilnehmer eintragen."]
[0.74896413226738223,22,22,null,null,null,null,null,15,null,null,null,null,null,null,null,null,null,null,null,null,null,null,null,null,0,0,0,0,"Bitte mindestens 24 Teilnehmer eintragen. "]
[0.9180689664599917,4,4,null,null,null,null,null,16,null,null,null,null,null,null,null,null,null,null,null,null,null,null,null,null,0,0,0,0,"Bitte mindestens 28 Teilnehmer eintragen. "]
[0.30410706484413408,77,77,null,null,null,null,null,17,null,null,null,null,null,null,null,null,null,null,null,null,null,null,null,null,0,0,0,0,"Bitte mindestens 32 Teilnehmer eintragen."]
[0.80107183728510833,15,15,null,null,null,null,null,18,null,null,null,null,null,null,null,null,null,null,null,null,null,null,null,null,0,0,0,0,"Bitte mindestens 36 Teilnehmer eintragen."]
[6.5985621723463228E-2,94,94,null,null,null,null,null,19,null,null,null,null,null,null,null,null,null,null,null,null,null,null,null,null,0,0,0,0,"Bitte mindestens 40 Teilnehmer eintragen. "]
[0.57334734061861392,40,40,null,null,null,null,null,20,null,null,null,null,null,null,null,null,null,null,null,null,null,null,null,null,0,0,0,0,"Bitte mindestens 44 Teilnehmer eintragen"]
[0.5721729932029086,41,41,null,null,null,null,null,21,null,null,null,null,null,null,null,null,null,null,null,null,null,null,null,null,0,0,0,0,"Bitte mindestens 48 Teilnehmer eintragen"]
[0.72019018985765293,26,26,null,null,null,null,null,22,null,null,null,null,null,null,null,null,null,null,null,null,null,null,null,null,0,0,0,0,"Bitte mindestens 52 Teilnehmer eintragen"]
[0.59509286699252917,38,38,null,null,null,null,null,23,null,null,null,null,null,null,null,null,null,null,null,null,null,null,null,null,0,0,0,0,"Bitte mindestens 56 Teilnehmer eintragen"]
[0.85192120105761038,12,12,null,null,null,null,null,24,null,null,null,null,null,null,null,null,null,null,null,null,null,null,null,null,0,0,0,0,"Bitte mindestens 60 Teilnehmer eintragen"]
[0.90441878938526332,6,6,null,null,null,null,null,25,null,null,null,null,null,null,null,null,null,null,null,null,null,null,null,null,0,0,0,0,"Bitte mindestens 64 Teilnehmer eintragen"]
[0.92341220185255413,3,3,null,null,null,null,null,26,null,null,null,null,null,null,null,null,null,null,null,null,null,null,null,null,0,0,0,0,"Bitte mindestens 68 Teilnehmer eintragen"]
[1.9240294719213513E-2,100,100,null,null,null,null,null,27,null,null,null,null,null,null,null,null,null,null,null,null,null,null,null,null,0,0,0,0,"Bitte mindestens 72 Teilnehmer eintragen"]
[0.72606055724424157,24,24,null,null,null,null,null,28,null,null,null,null,null,null,null,null,null,null,null,null,null,null,null,null,0,0,0,0,"Bitte mindestens 76 Teilnehmer eintragen"]
[0.3895165651833058,67,67,null,null,null,null,null,29,null,null,null,null,null,null,null,null,null,null,null,null,null,null,null,null,0,0,0,0,"Bitte mindestens 80 Teilnehmer eintragen"]
[0.5564076993132957,46,46,null,null,null,null,null,30,null,null,null,null,null,null,null,null,null,null,null,null,null,null,null,null,0,0,0,0,"Bitte mindestens 84 Teilnehmer eintragen"]
[0.55492814907150934,47,47,null,null,null,null,null,31,null,null,null,null,null,null,null,null,null,null,null,null,null,null,null,null,0,0,0,0,"Bitte mindestens 88Teilnehmer eintragen"]
[0.41399057613263957,64,64,null,null,null,null,null,32,null,null,null,null,null,null,null,null,null,null,null,null,null,null,null,null,0,0,0,0,"Bitte mindestens 92 Teilnehmer eintragen"]
[0.61270292069190424,34,34,null,null,null,null,null,33,null,null,null,null,null,null,null,null,null,null,null,null,null,null,null,null,{"$f":"IF(K39>\"\",1,0)","v":0},0,0,0,"Bitte mindestens 96 Teilnehmer eintragen"]
[0.42452805877409738,62,62,null,null,null,null,null,34,null,null,null,null,null,null,null,null,null,null,null,null,null,null,null,null,0,{"$f":"IF(J40>\"\",1,0)","v":0},{"$f":"IF(N40>\"\",1,0)","v":0},0,"Bitte mindestens 100 Teilnehmer eintragen"]
[3.6482257359881975E-2,98,98,null,null,null,null,null,35,null,null,null,null,null,null,null,null,null,null,null,null,null,null,null,null,0,0,0,0]
[0.57675793201388703,39,39,null,null,null,null,null,36,null,null,null,null,null,null,null,null,null,null,null,null,null,null,null,null,0,0,0,0]
[0.53229347039306818,49,49,null,null,null,null,null,37,null,null,null,null,null,null,null,null,null,null,null,null,null,null,null,null,0,0,0,0]
[6.815765886275682E-2,93,93,null,null,null,null,null,38,null,null,null,null,null,null,null,null,null,null,null,null,null,null,null,null,0,0,0,0]
[0.89986079344989411,8,8,null,null,null,null,null,39,null,null,null,null,null,null,null,null,null,null,null,null,null,null,null,null,0,0,0,0]
[0.64045806781110171,32,32,null,null,null,null,null,40,null,null,null,null,null,null,null,null,null,null,null,null,null,null,null,null,0,0,0,0]
[0.38309715495786756,68,68,null,null,null,null,null,41,null,null,null,null,null,null,null,null,null,null,null,null,null,null,null,null,0,0,0,0]
[0.32915128480753886,72,72,null,null,null,null,null,42,null,null,null,null,null,null,null,null,null,null,null,null,null,null,null,null,0,0,0,0]
[0.76975650355733172,17,17,null,null,null,null,null,43,null,null,null,null,null,null,null,null,null,null,null,null,null,null,null,null,0,0,0,0]
[0.74957376475101811,21,21,null,null,null,null,null,44,null,null,null,null,null,null,null,null,null,null,null,null,null,null,null,null,0,0,0,0]
[0.17696932671411769,85,85,null,null,null,null,null,45,null,null,null,null,null,null,null,null,null,null,null,null,null,null,null,null,0,0,0,0]
[0.7579934848108083,19,19,null,null,null,null,null,46,null,null,null,null,null,null,null,null,null,null,null,null,null,null,null,null,0,0,0,0]
[2.1189908312768457E-2,99,99,null,null,null,null,null,47,null,null,null,null,null,null,null,null,null,null,null,null,null,null,null,null,0,0,0,0]
[5.046223260254612E-2,97,97,null,null,null,null,null,48,null,null,null,null,null,null,null,null,null,null,null,null,null,null,null,null,0,0,0,0]
[0.32097028634931657,74,74,null,null,null,null,null,49,null,null,null,null,null,null,null,null,null,null,null,null,null,null,null,null,0,0,0,0]
[0.60581155818569499,36,36,null,null,null,null,null,50,null,null,null,null,null,null,null,null,null,null,null,null,null,null,null,null,0,0,0,0]
[0.79628126500782792,16,16,null,null,null,null,null,51,null,null,null,null,null,null,null,null,null,null,null,null,null,null,null,null,0,0,0,0]
[0.4192406324600555,63,63,null,null,null,null,null,52,null,null,null,null,null,null,null,null,null,null,null,null,null,null,null,null,0,0,0,0]
[0.67144892913493137,30,30,null,null,null,null,null,53,null,null,null,null,null,null,null,null,null,null,null,null,null,null,null,null,0,0,0,0]
[0.55943500613497088,43,43,null,null,null,null,null,54,null,null,null,null,null,null,null,null,null,null,null,null,null,null,null,null,0,0,0,0]
[0.34803509936174348,71,71,null,null,null,null,null,55,null,null,null,null,null,null,null,null,null,null,null,null,null,null,null,null,0,0,0,0]
[0.4476679768342865,57,57,null,null,null,null,null,56,null,null,null,null,null,null,null,null,null,null,null,null,null,null,null,null,0,0,0,0]
[0.19154680172611682,83,83,null,null,null,null,null,57,null,null,null,null,null,null,null,null,null,null,null,null,null,null,null,null,0,0,0,0]
[0.21128505469214831,81,81,null,null,null,null,null,58,null,null,null,null,null,null,null,null,null,null,null,null,null,null,null,null,0,0,0,0]
[0.55768240419030202,45,45,null,null,null,null,null,59,null,null,null,null,null,null,null,null,null,null,null,null,null,null,null,null,0,0,0,0]
[0.56493418940891882,42,42,null,null,null,null,null,60,null,null,null,null,null,null,null,null,null,null,null,null,null,null,null,null,0,0,0,0]
[{"$f":"RAND()","v":0.3277074354921653},{"$f":"RANK(A67,$A$7:$A$106)","v":73},{"$f":"B67","v":73},null,null,null,null,null,61,null,null,null,null,null,null,null,null,null,null,null,null,null,null,null,null,0,0,0,{"$f":"IF(Q67>\"\",1,0)","v":0}]
[{"$f":"RAND()","v":0.89999764281607786},{"$f":"RANK(A68,$A$7:$A$106)","v":7},7,null,null,null,null,null,62,null,null,null,null,null,null,null,null,null,null,null,null,null,null,null,null,0,0,0,0]
[{"$f":"RAND()","v":0.55871958636679342},{"$f":"RANK(A69,$A$7:$A$106)","v":44},44,null,null,null,null,null,63,null,null,null,null,null,null,null,null,null,null,null,null,null,null,null,null,0,0,0,0]
[{"$f":"RAND()","v":0.21454205970551976},{"$f":"RANK(A70,$A$7:$A$106)","v":80},80,null,null,null,null,null,64,null,null,null,null,null,null,null,null,null,null,null,null,null,null,null,null,0,0,0,0]
[{"$f":"RAND()","v":0.50227950533053323},{"$f":"RANK(A71,$A$7:$A$106)","v":52},52,null,null,null,null,null,65,null,null,null,null,null,null,null,null,null,null,null,null,null,null,null,null,{"$f":"IF(K71>\"\",1,0)","v":0},0,0,0]
[{"$f":"RAND()","v":0.42570498048079397},61,61,null,null,null,null,null,66,null,null,null,null,null,null,null,null,null,null,null,null,null,null,null,null,0,{"$f":"IF(J72>\"\",1,0)","v":0},{"$f":"IF(N72>\"\",1,0)","v":0},0]
[0.22124338706096547,79,79,null,null,null,null,null,67,null,null,null,null,null,null,null,null,null,null,null,null,null,null,null,null,0,0,0,0]
[0.45632678074131316,55,55,null,null,null,null,null,68,null,null,null,null,null,null,null,null,null,null,null,null,null,null,null,null,0,0,0,0]
[0.43602626851182291,60,60,null,null,null,null,null,69,null,null,null,null,null,null,null,null,null,null,null,null,null,null,null,null,0,0,0,0]
[0.37544763015345717,69,69,null,null,null,null,null,70,null,null,null,null,null,null,null,null,null,null,null,null,null,null,null,null,0,0,0,0]
[0.61046669072800763,35,35,null,null,null,null,null,71,null,null,null,null,null,null,null,null,null,null,null,null,null,null,null,null,0,0,0,0]
[0.86088112695445906,10,10,null,null,null,null,null,72,null,null,null,null,null,null,null,null,null,null,null,null,null,null,null,null,0,0,0,0]
[0.66434138157505462,31,31,null,null,null,null,null,73,null,null,null,null,null,null,null,null,null,null,null,null,null,null,null,null,0,0,0,0]
[0.50057108924549154,53,53,null,null,null,null,null,74,null,null,null,null,null,null,null,null,null,null,null,null,null,null,null,null,0,0,0,0]
[7.4318267186237685E-2,91,91,null,null,null,null,null,75,null,null,null,null,null,null,null,null,null,null,null,null,null,null,null,null,0,0,0,0]
[0.4532028382362614,56,56,null,null,null,null,null,76,null,null,null,null,null,null,null,null,null,null,null,null,null,null,null,null,0,0,0,0]
[0.39689103383598445,66,66,null,null,null,null,null,77,null,null,null,null,null,null,null,null,null,null,null,null,null,null,null,null,0,0,0,0]
[0.95227336342334512,2,2,null,null,null,null,null,78,null,null,null,null,null,null,null,null,null,null,null,null,null,null,null,null,0,0,0,0]
[0.20275653098690105,82,82,null,null,null,null,null,79,null,null,null,null,null,null,null,null,null,null,null,null,null,null,null,null,0,0,0,0]
[0.16738442522400732,86,86,null,null,null,null,null,80,null,null,null,null,null,null,null,null,null,null,null,null,null,null,null,null,{"$f":"IF(K86>\"\",1,0)","v":0},{"$f":"IF(J86>\"\",1,0)","v":0},{"$f":"IF(N86>\"\",1,0)","v":0},0]
[0.72427054432041682,25,25,null,null,null,null,null,81,null,null,null,null,null,null,null,null,null,null,null,null,null,null,null,null,0,0,0,0]
[0.85824957504247934,11,11,null,null,null,null,null,82,null,null,null,null,null,null,null,null,null,null,null,null,null,null,null,null,0,0,0,0]
[0.31800817357511735,75,75,null,null,null,null,null,83,null,null,null,null,null,null,null,null,null,null,null,null,null,null,null,null,0,0,0,0]
[0.52603799443941524,50,50,null,null,null,null,null,84,null,null,null,null,null,null,null,null,null,null,null,null,null,null,null,null,0,0,0,0]
[0.80612146317656685,14,14,null,null,null,null,null,85,null,null,null,null,null,null,null,null,null,null,null,null,null,null,null,null,0,0,0,0]
[0.50595359673803098,51,51,null,null,null,null,null,86,null,null,null,null,null,null,null,null,null,null,null,null,null,null,null,null,0,0,0,0]
[0.14044618264594266,89,89,null,null,null,null,null,87,null,null,null,null,null,null,null,null,null,null,null,null,null,null,null,null,0,0,0,0]
[0.37535323270177834,70,70,null,null,null,null,null,88,null,null,null,null,null,null,null,null,null,null,null,null,null,null,null,null,0,0,0,0]
[0.71807696943670885,27,27,null,null,null,null,null,89,null,null,null,null,null,null,null,null,null,null,null,null,null,null,null,null,0,0,0,0]
[0.76931505376142295,18,18,null,null,null,null,null,90,null,null,null,null,null,null,null,null,null,null,null,null,null,null,null,null,0,0,0,0]
[0.75095623795892608,20,20,null,null,null,null,null,91,null,null,null,null,null,null,null,null,null,null,null,null,null,null,null,null,0,0,0,0]
[0.81013838822050999,13,13,null,null,null,null,null,92,null,null,null,null,null,null,null,null,null,null,null,null,null,null,null,null,0,0,0,0]
[0.15029421412704747,88,88,null,null,null,null,null,93,null,null,null,null,null,null,null,null,null,null,null,null,null,null,null,null,0,0,0,0]
[0.90485288017924648,5,5,null,null,null,null,null,94,null,null,null,null,null,null,null,null,null,null,null,null,null,null,null,null,0,0,0,0]
[7.1765029854440665E-2,92,92,null,null,null,null,null,95,null,null,null,null,null,null,null,null,null,null,null,null,null,null,null,null,0,0,0,0]
[0.15933620299228024,87,87,null,null,null,null,null,96,null,null,null,null,null,null,null,null,null,null,null,null,null,null,null,null,0,0,0,0]
[0.62278980336678869,{"$f":"RANK(A103,$A$7:$A$106)","v":33},33,null,null,null,null,null,97,null,null,null,null,null,null,null,null,null,null,null,null,null,null,null,null,0,0,0,0]
[0.18815350408769538,{"$f":"RANK(A104,$A$7:$A$106)","v":84},84,null,null,null,null,null,98,null,null,null,null,null,null,null,null,null,null,null,null,null,null,null,null,0,0,0,0]
[0.39860247359053558,{"$f":"RANK(A105,$A$7:$A$106)","v":65},65,null,null,null,null,null,99,null,null,null,null,null,null,null,null,null,null,null,null,null,null,null,null,0,0,0,0]
[0.99099992452448005,{"$f":"RANK(A106,$A$7:$A$106)","v":1},1,null,null,null,null,null,100,null,null,null,null,null,null,null,null,null,null,null,null,null,null,null,null,0,0,0,0]

{"sheet":"Original","index":1,"n_rows":106,"n_cols":26,"rows_kept":106,"cut":false,"hidden":true,"merged":[]}
[null,null,null,null,null,null,null,null,null,null,"1.Runde",null,null,"2.Runde",null,null,"3.Runde",null,null,"4.Runde",null,null,"5.Runde",null,null,"6.Runde"]
[null,null,null,null,null,null,null,null,null,"Teilnehmer:",{"$f":"IF(J11=\"\",4,IF(J15=\"\",8,IF(J19=\"\",12,IF(J23=\"\",16,IF(J27=\"\",20,IF(J31=\"\",24,IF(J35=\"\",28,IF(J39=\"\",32,IF(J43=\"\",36,IF(J47=\"\",40,IF(J51=\"\",44,IF(J55=\"\",48,IF(J59=\"\",52,IF(J63=\"\",56,IF(J67=\"\",60,IF(J71=\"\",64,IF(J75=\"\",68,IF(J79=\"\",72,IF(J83=\"\",76,IF(J87=\"\",80,IF(J91=\"\",84,IF(J95=\"\",88,IF(J99=\"\",92,IF(J103=\"\",96,100))))))))))))))))))))))))","v":4},{"$f":"ROUNDUP(K2/4,0)","v":1},{"$f":"L2/2","v":0.5},{"$f":"IF(K2<=4,0,ROUNDUP(M2,0)*4)","v":0},{"$f":"ROUNDUP(N2/4,0)","v":0},{"$f":"O2/2","v":0},{"$f":"IF(N2<=4,0,ROUNDUP(P2,0)*4)","v":0},{"$f":"ROUNDUP(Q2/4,0)","v":0},{"$f":"R2/2","v":0},{"$f":"IF(Q2<=4,0,ROUNDUP(S2,0)*4)","v":0},{"$f":"ROUNDUP(T2/4,0)","v":0},{"$f":"U2/2","v":0},{"$f":"IF(T2<=4,0,ROUNDUP(V2,0)*4)","v":0},{"$f":"ROUNDUP(W2/4,0)","v":0},{"$f":"SUM(X2/2)","v":0},{"$f":"IF(W2<=4,0,ROUNDUP(Y2,0)*4)","v":0}]
[null,null,null,null,null,null,null,null,null,"Die Teilnehmerzahl in der Ersten Runde sollte immer durch 4 teilbar sein. Anwendung nur für max 100 Spieler."]
[null,null,null,null,null,null,null,null,null,"In der Teilnehmerlisten werden ggf. 3 Pseudo-Namen eingetragen"]
[]
[null,null,"Nr.:",null,null,null,null,null,"Nr.:","Vorname","Name",null,null,"Alter",null,null,"E-Mail Adresse"]
[{"$f":"RAND()","v":0.54945984245360435},{"$f":"RANK(A7,$A$7:$A$106)","v":50},{"$f":"B7","v":50},null,null,null,null,null,1]
[{"$f":"RAND()","v":0.85488138186906082},14,{"$f":"B8","v":14},null,null,null,null,null,2]
[0.27409412634311814,74,74,null,null,null,null,null,3]
[0.55192879091721736,48,48,null,null,null,null,null,4]
[0.41761010817136435,65,65,null,null,null,null,null,5]
[0.57069309897398068,45,45,null,null,null,null,null,6]
[0.64052006071719447,36,36,null,null,null,null,null,7]
[5.2430750886842681E-3,100,100,null,null,null,null,null,8]
[0.89836575822004605,11,11,null,null,null,null,null,9]
[0.79737152792439203,18,18,null,null,null,null,null,10]
[0.52313516963475415,55,55,null,null,null,null,null,11]
[0.96276995793610176,6,6,null,null,null,null,null,12]
[0.95726426228350014,7,7,null,null,null,null,null,13]
[0.61731775273354961,40,40,null,null,null,null,null,14]
[0.11927315391110616,87,87,null,null,null,null,null,15]
[0.12305905663540206,86,86,null,null,null,null,null,16]
[0.13572992632380643,85,85,null,null,null,null,null,17]
[0.61021465386586049,42,42,null,null,null,null,null,18]
[6.2086124073853277E-2,94,94,null,null,null,null,null,19]
[0.89214006139628388,12,12,null,null,null,null,null,20]
[6.0589168363977208E-2,95,95,null,null,null,null,null,21]
[0.72266810895110412,28,28,null,null,null,null,null,22]
[0.68176892286122348,32,32,null,null,null,null,null,23]
[0.73291114287179659,25,25,null,null,null,null,null,24]
[0.69607262468248698,30,30,null,null,null,null,null,25]
[6.619454308017636E-2,93,93,null,null,null,null,null,26]
[0.52355131378522324,54,54,null,null,null,null,null,27]
[0.85660243850696349,13,13,null,null,null,null,null,28]
[0.35797266042710207,68,68,null,null,null,null,null,29]
[0.54224114522630218,52,52,null,null,null,null,null,30]
[0.22575450088605264,79,79,null,null,null,null,null,31]
[0.3329649427160104,71,71,null,null,null,null,null,32]
[0.72793701840940017,27,27,null,null,null,null,null,33]
[5.8068405472242568E-2,96,96,null,null,null,null,null,34]
[0.42395849143800424,64,64,null,null,null,null,null,35]
[0.33749914813524651,70,70,null,null,null,null,null,36]
[0.70596403501779603,29,29,null,null,null,null,null,37]
[8.9958225172322881E-2,91,91,null,null,null,null,null,38]
[2.0689885801830732E-2,98,98,null,null,null,null,null,39]
[0.66093678739625383,34,34,null,null,null,null,null,40]
[0.80352255268840911,17,17,null,null,null,null,null,41]
[0.28859960683164598,73,73,null,null,null,null,null,42]
[0.6819126369737879,31,31,null,null,null,null,null,43]
[0.38778818726561859,66,66,null,null,null,null,null,44]
[0.25523802040556831,78,78,null,null,null,null,null,45]
[0.55069189051378931,49,49,null,null,null,null,null,46]
[0.98663815558924017,2,2,null,null,null,null,null,47]
[0.48314017613783,57,57,null,null,null,null,null,48]
[0.16033921789200933,84,84,null,null,null,null,null,49]
[0.57103060498023295,44,44,null,null,null,null,null,50]
[4.3759189646834784E-2,97,97,null,null,null,null,null,51]
[0.38633837504702084,67,67,null,null,null,null,null,52]
[0.25756792954968566,77,77,null,null,null,null,null,53]
[0.97598733558105644,4,4,null,null,null,null,null,54]
[0.44920439946215285,59,59,null,null,null,null,null,55]
[6.8350009259272038E-2,92,92,null,null,null,null,null,56]
[0.68021910645594452,33,33,null,null,null,null,null,57]
[0.58198678072531929,43,43,null,null,null,null,null,58]
[0.26540260612676425,76,76,null,null,null,null,null,59]
[0.98705776005663737,1,1,null,null,null,null,null,60]
[0.43572781846991915,61,61,null,null,null,null,null,61]
[0.9849467185798213,3,3,null,null,null,null,null,62]
[0.62130293446906248,38,38,null,null,null,null,null,63]
[0.32878074098274257,72,72,null,null,null,null,null,64]
[0.7352491913953122,{"$f":"RANK(A71,$A$7:$A$106)","v":24},24,null,null,null,null,null,65]
[{"$f":"RAND()","v":0.17487454131823676},83,{"$f":"B72","v":83},null,null,null,null,null,66]
[0.56148655600376873,46,46,null,null,null,null,null,67]
[0.83496797247500965,15,15,null,null,null,null,null,68]
[0.62066152125473228,39,39,null,null,null,null,null,69]
[0.53155199635426009,53,53,null,null,null,null,null,70]
[0.10011749910339318,90,90,null,null,null,null,null,71]
[0.72808314713812561,26,26,null,null,null,null,null,72]
[0.90373350389474372,9,9,null,null,null,null,null,73]
[0.89932677295996111,10,10,null,null,null,null,null,74]
[0.55336915086299365,47,47,null,null,null,null,null,75]
[0.11317501933656937,88,88,null,null,null,null,null,76]
[0.61463716585849826,41,41,null,null,null,null,null,77]
[0.44533772459184118,60,60,null,null,null,null,null,78]
[0.34670353570817514,69,69,null,null,null,null,null,79]
[0.96398624865240723,5,5,null,null,null,null,null,80]
[0.5187381965589648,56,56,null,null,null,null,null,81]
[0.54862768823535579,51,51,null,null,null,null,null,82]
[0.76777663467187773,20,20,null,null,null,null,null,83]
[0.2730104951661203,75,75,null,null,null,null,null,84]
[0.74100349499378648,23,23,null,null,null,null,null,85]
[0.82020761127303821,16,16,null,null,null,null,null,86]
[0.65639576756404805,35,35,null,null,null,null,null,87]
[0.1870430499030924,82,82,null,null,null,null,null,88]
[0.22196255655690678,80,80,null,null,null,null,null,89]
[0.10566267752704828,89,89,null,null,null,null,null,90]
[0.20191735331947591,81,81,null,null,null,null,null,91]
[0.47436919795680088,58,58,null,null,null,null,null,92]
[0.43462276813615164,63,63,null,null,null,null,null,93]
[0.435199434184811,62,62,null,null,null,null,null,94]
[0.74936028831355994,22,22,null,null,null,null,null,95]
[0.79700155256217176,19,19,null,null,null,null,null,96]
[5.2677082234143802E-3,99,99,null,null,null,null,null,97]
[0.94973879790679916,8,8,null,null,null,null,null,98]
[0.75200903217218329,21,21,null,null,null,null,null,99]
[0.63668126549748927,37,37,null,null,null,null,null,100]

{"sheet":"Auswertung Runde 1","index":2,"n_rows":37,"n_cols":7,"rows_kept":37,"cut":false,"hidden":true,"merged":[]}
["Vorname","Name","Alter",1,"Nr.:","Platzierung","Punkte"]
["Test17","17",116,30,22,1,65]
["Test60","60",159,27,19,1,9]
["Test15","15",114,75,52,1,9]
["Test49","49",148,76,53,1,9]
["Test1","1",100,86,59,1,9]
["Test38","38",137,69,47,1,8]
["Test20","20",119,100,68,1,8]
["Test31","31",130,10,8,1,7]
["Test16","16",115,15,11,1,7]
["Test47","47",146,18,13,1,7]
["Test28","28",127,91,62,1,7]
["Test36","36",135,53,36,1,6]
["Test54","54",153,54,37,1,6]
["Test53","53",152,65,44,1,6]
["Test19","19",118,40,28,1,5]
["Test48","48",147,45,30,1,5]
["Test34","34",133,4,4,1,4]
["Test62","62",161,33,23,2,8]
["Test9","9",108,73,50,2,8]
["Test37","37",136,25,18,2,7]
["Test22","22",121,71,48,2,7]
["Test68","68",167,79,55,2,7]
["Test30","30",129,82,57,2,7]
["Test24","24",123,99,67,2,7]
["Test57","57",156,9,7,2,6]
["Test39","39",138,13,9,2,6]
["Test5","5",104,22,15,2,6]
["Test43","43",142,92,63,2,6]
["Test14","14",113,51,34,2,5]
["Test58","58",157,55,38,2,5]
["Test35","35",134,64,43,2,5]
["Test67","67",166,36,26,2,4]
["Test27","27",126,42,29,2,4]
["Test45","45",144,3,3,2,3]
["Test7","7",106,72,49,3,7]
["Test3","3",102,24,17,3,6]

{"sheet":"Runde 1","index":3,"n_rows":102,"n_cols":74,"rows_kept":102,"cut":false,"hidden":false,"merged":[[28,52,29,56],[28,60,29,64],[19,60,20,64],[39,19,41,32],[1,19,2,23],[10,19,11,23],[19,19,20,23],[28,19,29,23],[28,28,29,32],[19,28,20,32],[10,28,11,32],[1,28,2,32],[1,68,2,72],[1,52,2,56],[10,52,11,56],[19,52,20,56],[39,36,41,48],[39,52,41,64],[1,36,2,40],[10,36,11,40],[19,36,20,40],[28,36,29,40],[28,44,29,48],[10,60,11,64],[1,60,2,64],[19,44,20,48],[10,44,11,48],[1,44,2,48]]}
[null,null,null,null,null,null,null,null,null,null,null,null,null,null,null,null,null,null,null,"2.Runde starten >",null,null,null,null,null,null,null,null,null,null,null,null,null,"Es wurden nicht für jeden Spieler Punkte in dieser Runde eingetragen !!!",{"$f":"IF(T40=\"Eingabe o.k.\",1,\"\")","v":1},null,{"$f":"IF(AND(P10<>\"\",H10=\"\"),AH2,IF(AND(P11<>\"\",H11=\"\"),AH2,IF(AND(P12<>\"\",H12=\"\"),AH2,IF(AND(P13<>\"\",H13=\"\"),AH2,IF(AND(P14<>\"\",H14=\"\"),AH2,IF(AND(P15<>\"\",H15=\"\"),AH2,IF(AND(P16<>\"\",H16=\"\"),AH2,IF(AND(P17<>\"\",H17=\"\"),AH2,IF(AND(P18<>\"\",H18=\"\"),AH2,IF(AND(P19<>\"\",H19=\"\"),AH2,IF(AND(P20<>\"\",H20=\"\"),AH2,IF(AND(P21<>\"\",H21=\"\"),AH2,IF(AND(P22<>\"\",H22=\"\"),AH2,IF(AND(P23<>\"\",H23=\"\"),AH2,IF(AND(P24<>\"\",H24=\"\"),AH2,IF(AND(P25<>\"\",H25=\"\"),AH2,IF(AND(P26<>\"\",H26=\"\"),AH2,IF(AND(P27<>\"\",H27=\"\"),AH2,IF(AND(P28<>\"\",H28=\"\"),AH2,IF(AND(P29<>\"\",H29=\"\"),AH2,IF(AND(P30<>\"\",H30=\"\"),AH2,IF(AND(P31<>\"\",H31=\"\"),AH2,IF(AND(P32<>\"\",H32=\"\"),AH2,IF(AND(P33<>\"\",H33=\"\"),AH2,IF(AND(P34<>\"\",H34=\"\"),AH2,IF(AND(P35<>\"\",H35=\"\"),AH2,IF(AND(P36<>\"\",H36=\"\"),AH2,IF(AND(P37<>\"\",H37=\"\"),AH2,IF(AND(P38<>\"\",H38=\"\"),AH2,AL1)))))))))))))))))))))))))))))","v":"Eingabe o.k."},{"$f":"IF(AND(P39<>\"\",H39=\"\"),AH2,IF(AND(P40<>\"\",H40=\"\"),AH2,IF(AND(P41<>\"\",H41=\"\"),AH2,IF(AND(P42<>\"\",H42=\"\"),AH2,IF(AND(P43<>\"\",H43=\"\"),AH2,IF(AND(P44<>\"\",H44=\"\"),AH2,IF(AND(P45<>\"\",H45=\"\"),AH2,IF(AND(P46<>\"\",H46=\"\"),AH2,IF(AND(P47<>\"\",H47=\"\"),AH2,IF(AND(P48<>\"\",H48=\"\"),AH2,IF(AND(P49<>\"\",H49=\"\"),AH2,IF(AND(P50<>\"\",H50=\"\"),AH2,IF(AND(P51<>\"\",H51=\"\"),AH2,IF(AND(P52<>\"\",H52=\"\"),AH2,IF(AND(P53<>\"\",H53=\"\"),AH2,IF(AND(P54<>\"\",H54=\"\"),AH2,IF(AND(P55<>\"\",H55=\"\"),AH2,IF(AND(P56<>\"\",H56=\"\"),AH2,IF(AND(P57<>\"\",H57=\"\"),AH2,IF(AND(P58<>\"\",H58=\"\"),AH2,IF(AND(P59<>\"\",H59=\"\"),AH2,IF(AND(P60<>\"\",H60=\"\"),AH2,IF(AND(P61<>\"\",H61=\"\"),AH2,IF(AND(P62<>\"\",H62=\"\"),AH2,AM1))))))))))))))))))))))))","v":"Eingabe o.k."},{"$f":"IF(AND(P63<>\"\",H63=\"\"),AH2,IF(AND(P64<>\"\",H64=\"\"),AH2,IF(AND(P65<>\"\",H65=\"\"),AH2,IF(AND(P66<>\"\",H67=\"\"),AH2,IF(AND(P68<>\"\",H68=\"\"),AH2,IF(AND(P69<>\"\",H70=\"\"),AH2,IF(AND(P71<>\"\",H71=\"\"),AH2,IF(AND(P72<>\"\",H72=\"\"),AH2,IF(AND(P73<>\"\",H73=\"\"),AH2,IF(AND(P74<>\"\",H74=\"\"),AH2,IF(AND(P75<>\"\",H75=\"\"),AH2,IF(AND(P76<>\"\",H76=\"\"),AH2,IF(AND(P77<>\"\",H77=\"\"),AH2,IF(AND(P78<>\"\",H78=\"\"),AH2,IF(AND(P79<>\"\",H79=\"\"),AH2,IF(AND(P80<>\"\",H80=\"\"),AH2,IF(AND(P81<>\"\",H81=\"\"),AH2,IF(AND(P82<>\"\",H82=\"\"),AH2,IF(AND(P83<>\"\",H83=\"\"),AH2,IF(AND(P84<>\"\",H84=\"\"),AH2,IF(AND(P85<>\"\",H85=\"\"),AH2,IF(AND(P86<>\"\",H86=\"\"),AH2,IF(AND(P87<>\"\",H87=\"\"),AH2,IF(AND(P88<>\"\",H88=\"\"),AH2,IF(AND(P89<>\"\",H89=\"\"),AH2,IF(AND(P90<>\"\",H90=\"\"),AH2,IF(AND(P91<>\"\",H91=\"\"),AH2,IF(AND(P92<>\"\",H92=\"\"),AH2,IF(AND(P93<>\"\",H93=\"\"),AH2,IF(AND(P94<>\"\",H94=\"\"),AH2,IF(AND(P95<>\"\",H95=\"\"),AH2,IF(AND(P96<>\"\",H96=\"\"),AH2,IF(AND(P97<>\"\",H97=\"\"),AH2,IF(AND(P102<>\"\",102=\"\"),AH2,IF(AND(P98<>\"\",H98=\"\"),AH2,IF(AND(P99<>\"\",H99=\"\"),AH2,IF(AND(P100<>\"\",H100=\"\"),AH2,IF(AND(P101<>\"\",H101=\"\"),AH2,\"Eingabe o.k.\"))))))))))))))))))))))))))))))))))))))","v":"Eingabe o.k."}]
[1,null,null,null,null,"Nr.:",null,"Vorname","Name",null,null,"Alter",{"$f":"IF(H2>\"\",A2,999)","v":1},"Nr.:","Platzierung","Punkte",null,null,null,{"$f":"IF(ISTEXT('Teilnehmer Erfassung'!K2),\"Tisch 1 Rund 1\",IF('Teilnehmer Erfassung'!K2=4,\"Finale\",IF('Teilnehmer Erfassung'!K2=8,\"Halbfinale 1\",\"Tisch 1 Runde 1\")))","v":"Tisch 1 Rund 1"},null,null,null,null,null,null,null,null,"Tisch 5 Runde 1",null,null,null,null,"Es wurden Punkte eingetragen für die kein Spieler zugeordnet ist !!!",null,null,"Tisch 9 Runde 1",null,null,null,null,null,null,null,"Tisch 13 Runde 1",null,null,null,null,null,null,null,"Tisch 17 Runde 1",null,null,null,null,null,null,null,"Tisch 21 Runde 1",null,null,null,null,null,null,null,"Tisch 25 Runde 1"]
[1,null,null,null,null,1,19,null,null,null,null,null,{"$f":"IF(H3>\"\",A3,999)","v":999},1,{"$f":"IF(X5=\"\",\"\",X5)","v":""},{"$f":"IF(W5=\"\",\"\",W5)","v":""},null,null,null,null,null,null,null,null,null,null,null,null,null,null,null,null,null,"Es wurden nicht für jeden Spieler Punkte in dieser Runde eingetragen !!!"]
[2,null,null,null,null,2,62,null,null,null,null,null,999,2,{"$f":"IF(X6=\"\",\"\",X6)","v":""},{"$f":"IF(W6=\"\",\"\",W6)","v":""},null,null,null,"Vorname","Name","Alter","Punkte","Platzierung",null,null,null,null,"Vorname","Name","Alter","Punkte","Platzierung",null,null,null,"Vorname","Name","Alter","Punkte","Platzierung",null,null,null,"Vorname","Name","Alter","Punkte","Platzierung",null,null,null,"Vorname","Name","Alter","Punkte","Platzierung",null,null,null,"Vorname","Name","Alter","Punkte","Platzierung",null,null,null,"Vorname","Name","Alter","Punkte","Platzierung"]
[3,null,null,null,null,3,27,null,null,null,null,null,999,3,{"$f":"IF(X7=\"\",\"\",X7)","v":""},{"$f":"IF(W7=\"\",\"\",W7)","v":""},null,1,null,{"$f":"IF(H3=\"\",\"\",(VLOOKUP(R5,$F$3:$Q$102,3,0)))","v":""},{"$f":"IF(I3=\"\",\"\",(VLOOKUP(R5,$F$3:$N$102,4,0)))","v":""},{"$f":"IF(L3=\"\",\"\",VLOOKUP(R5,$F$3:$N$102,7,0))","v":""},null,{"$f":"IFERROR(IF(W5=\"\",\"\",RANK(W5,$W$5:$W$8)),0)","v":""},1,{"$f":"IF(T5=\"\",0,1)","v":0},null,17,{"$f":"IF(H19=\"\",\"\",(VLOOKUP(AB5,$F$3:$N$102,3,0)))","v":""},{"$f":"IF(I19=\"\",\"\",(VLOOKUP(AB5,$F$3:$N$102,4,0)))","v":""},{"$f":"IF(L19=\"\",\"\",(VLOOKUP(AB5,$F$3:$N$102,7,0)))","v":""},null,{"$f":"IFERROR(IF(AF5=\"\",\"\",RANK(AF5,$AF$5:$AF$8)),0)","v":""},{"$f":"IF(AC5=\"\",0,1)","v":0},null,33,{"$f":"IF(H35=\"\",\"\",(VLOOKUP(AJ5,$F$3:$N$102,3,0)))","v":""},{"$f":"IF(I35=\"\",\"\",(VLOOKUP(AJ5,$F$3:$N$102,4,0)))","v":""},{"$f":"IF(L35=\"\",\"\",(VLOOKUP(AJ5,$F$3:$N$102,7,0)))","v":""},null,{"$f":"IFERROR(IF(AN5=\"\",\"\",RANK(AN5,$AN$5:$AN$8)),0)","v":""},{"$f":"IF(AK5=\"\",0,1)","v":0},null,49,{"$f":"IF(H51=\"\",\"\",(VLOOKUP(AR5,$F$3:$N$102,3,0)))","v":""},{"$f":"IF(I51=\"\",\"\",(VLOOKUP(AR5,$F$3:$N$102,4,0)))","v":""},{"$f":"IF(L51=\"\",\"\",(VLOOKUP(AR5,$F$3:$N$102,7,0)))","v":""},null,{"$f":"IFERROR(IF(AV5=\"\",\"\",RANK(AV5,$AV$5:$AV$8)),0)","v":""},{"$f":"IF(AS5=\"\",0,1)","v":0},null,65,{"$f":"IF(H67=\"\",\"\",(VLOOKUP(AZ5,$F$3:$N$102,3,0)))","v":""},{"$f":"IF(L67=\"\",\"\",(VLOOKUP(AZ5,$F$3:$N$102,4,0)))","v":""},{"$f":"IF(L67=\"\",\"\",(VLOOKUP(AZ5,$F$3:$N$102,7,0)))","v":""},null,{"$f":"IFERROR(IF(BD5=\"\",\"\",RANK(BD5,$BD$5:$BD$8)),0)","v":""},{"$f":"IF(BA5=\"\",0,1)","v":0},null,81,{"$f":"IF(H83=\"\",\"\",(VLOOKUP(BH5,$F$3:$N$102,3,0)))","v":""},{"$f":"IF(I83=\"\",\"\",(VLOOKUP(BH5,$F$3:$N$102,4,0)))","v":""},{"$f":"IF(L83=\"\",\"\",(VLOOKUP(BH5,$F$3:$N$102,7,0)))","v":""},null,{"$f":"IFERROR(IF(BL5=\"\",\"\",RANK(BL5,$BL$5:$BL$8)),0)","v":""},{"$f":"IF(BI5=\"\",0,1)","v":0},null,97,{"$f":"IF(H99=\"\",\"\",(VLOOKUP(BP5,$F$3:$N$102,3,0)))","v":""},{"$f":"IF(I99=\"\",\"\",(VLOOKUP(BP5,$F$3:$N$102,4,0)))","v":""},{"$f":"IF(L99=\"\",\"\",(VLOOKUP(BP5,$F$3:$N$102,7,0)))","v":""},null,{"$f":"IFERROR(IF(BT5=\"\",\"\",RANK(BT5,$BT$5:$BT$8)),0)","v":""},{"$f":"IF(BQ5=\"\",0,1)","v":0}]
[4,null,null,null,null,4,9,null,null,null,null,null,999,4,{"$f":"IF(X8=\"\",\"\",X8)","v":""},{"$f":"IF(W8=\"\",\"\",W8)","v":""},null,2,null,{"$f":"IF(H4=\"\",\"\",(VLOOKUP(R6,$F$3:$Q$102,3,0)))","v":""},{"$f":"IF(I4=\"\",\"\",(VLOOKUP(R6,$F$3:$N$102,4,0)))","v":""},{"$f":"IF(L4=\"\",\"\",VLOOKUP(R6,$F$3:$N$102,7,0))","v":""},null,{"$f":"IFERROR(IF(W6=\"\",\"\",RANK(W6,$W$5:$W$8)),0)","v":""},1,null,null,18,{"$f":"IF(H20=\"\",\"\",(VLOOKUP(AB6,$F$3:$N$102,3,0)))","v":""},{"$f":"IF(I20=\"\",\"\",(VLOOKUP(AB6,$F$3:$N$102,4,0)))","v":""},{"$f":"IF(L20=\"\",\"\",(VLOOKUP(AB6,$F$3:$N$102,7,0)))","v":""},null,{"$f":"IFERROR(IF(AF6=\"\",\"\",RANK(AF6,$AF$5:$AF$8)),0)","v":""},null,null,34,{"$f":"IF(H36=\"\",\"\",(VLOOKUP(AJ6,$F$3:$N$102,3,0)))","v":""},{"$f":"IF(I36=\"\",\"\",(VLOOKUP(AJ6,$F$3:$N$102,4,0)))","v":""},{"$f":"IF(L36=\"\",\"\",(VLOOKUP(AJ6,$F$3:$N$102,7,0)))","v":""},null,{"$f":"IFERROR(IF(AN6=\"\",\"\",RANK(AN6,$AN$5:$AN$8)),0)","v":""},null,null,50,{"$f":"IF(H52=\"\",\"\",(VLOOKUP(AR6,$F$3:$N$102,3,0)))","v":""},{"$f":"IF(I52=\"\",\"\",(VLOOKUP(AR6,$F$3:$N$102,4,0)))","v":""},{"$f":"IF(L52=\"\",\"\",(VLOOKUP(AR6,$F$3:$N$102,7,0)))","v":""},null,{"$f":"IFERROR(IF(AV6=\"\",\"\",RANK(AV6,$AV$5:$AV$8)),0)","v":""},null,null,66,{"$f":"IF(H68=\"\",\"\",(VLOOKUP(AZ6,$F$3:$N$102,3,0)))","v":""},{"$f":"IF(L68=\"\",\"\",(VLOOKUP(AZ6,$F$3:$N$102,4,0)))","v":""},{"$f":"IF(L68=\"\",\"\",(VLOOKUP(AZ6,$F$3:$N$102,7,0)))","v":""},null,{"$f":"IFERROR(IF(BD6=\"\",\"\",RANK(BD6,$BD$5:$BD$8)),0)","v":""},null,null,82,{"$f":"IF(H84=\"\",\"\",(VLOOKUP(BH6,$F$3:$N$102,3,0)))","v":""},{"$f":"IF(I84=\"\",\"\",(VLOOKUP(BH6,$F$3:$N$102,4,0)))","v":""},{"$f":"IF(L84=\"\",\"\",(VLOOKUP(BH6,$F$3:$N$102,7,0)))","v":""},null,{"$f":"IFERROR(IF(BL6=\"\",\"\",RANK(BL6,$BL$5:$BL$8)),0)","v":""},null,null,98,{"$f":"IF(H100=\"\",\"\",(VLOOKUP(BP6,$F$3:$N$102,3,0)))","v":""},{"$f":"IF(I100=\"\",\"\",(VLOOKUP(BP6,$F$3:$N$102,4,0)))","v":""},{"$f":"IF(L100=\"\",\"\",(VLOOKUP(BP6,$F$3:$N$102,7,0)))","v":""},null,{"$f":"IFERROR(IF(BT6=\"\",\"\",RANK(BT6,$BT$5:$BT$8)),0)","v":""}]
[5,null,null,null,null,5,12,null,null,null,null,null,999,5,{"$f":"IF(X14=\"\",\"\",X14)","v":""},{"$f":"IF(W14=\"\",\"\",W14)","v":""},null,3,null,{"$f":"IF(H5=\"\",\"\",(VLOOKUP(R7,$F$3:$Q$102,3,0)))","v":""},{"$f":"IF(I5=\"\",\"\",(VLOOKUP(R7,$F$3:$N$102,4,0)))","v":""},{"$f":"IF(L5=\"\",\"\",VLOOKUP(R7,$F$3:$N$102,7,0))","v":""},null,{"$f":"IFERROR(IF(W7=\"\",\"\",RANK(W7,$W$5:$W$8)),0)","v":""},1,null,null,19,{"$f":"IF(H21=\"\",\"\",(VLOOKUP(AB7,$F$3:$N$102,3,0)))","v":""},{"$f":"IF(I21=\"\",\"\",(VLOOKUP(AB7,$F$3:$N$102,4,0)))","v":""},{"$f":"IF(L21=\"\",\"\",(VLOOKUP(AB7,$F$3:$N$102,7,0)))","v":""},null,{"$f":"IFERROR(IF(AF7=\"\",\"\",RANK(AF7,$AF$5:$AF$8)),0)","v":""},null,null,35,{"$f":"IF(H37=\"\",\"\",(VLOOKUP(AJ7,$F$3:$N$102,3,0)))","v":""},{"$f":"IF(I37=\"\",\"\",(VLOOKUP(AJ7,$F$3:$N$102,4,0)))","v":""},{"$f":"IF(L37=\"\",\"\",(VLOOKUP(AJ7,$F$3:$N$102,7,0)))","v":""},null,{"$f":"IFERROR(IF(AN7=\"\",\"\",RANK(AN7,$AN$5:$AN$8)),0)","v":""},null,null,51,{"$f":"IF(H53=\"\",\"\",(VLOOKUP(AR7,$F$3:$N$102,3,0)))","v":""},{"$f":"IF(I53=\"\",\"\",(VLOOKUP(AR7,$F$3:$N$102,4,0)))","v":""},{"$f":"IF(L53=\"\",\"\",(VLOOKUP(AR7,$F$3:$N$102,7,0)))","v":""},null,{"$f":"IFERROR(IF(AV7=\"\",\"\",RANK(AV7,$AV$5:$AV$8)),0)","v":""},null,null,67,{"$f":"IF(H69=\"\",\"\",(VLOOKUP(AZ7,$F$3:$N$102,3,0)))","v":""},{"$f":"IF(L69=\"\",\"\",(VLOOKUP(AZ7,$F$3:$N$102,4,0)))","v":""},{"$f":"IF(L69=\"\",\"\",(VLOOKUP(AZ7,$F$3:$N$102,7,0)))","v":""},null,{"$f":"IFERROR(IF(BD7=\"\",\"\",RANK(BD7,$BD$5:$BD$8)),0)","v":""},null,null,83,{"$f":"IF(H85=\"\",\"\",(VLOOKUP(BH7,$F$3:$N$102,3,0)))","v":""},{"$f":"IF(I85=\"\",\"\",(VLOOKUP(BH7,$F$3:$N$102,4,0)))","v":""},{"$f":"IF(L85=\"\",\"\",(VLOOKUP(BH7,$F$3:$N$102,7,0)))","v":""},null,{"$f":"IFERROR(IF(BL7=\"\",\"\",RANK(BL7,$BL$5:$BL$8)),0)","v":""},null,null,99,{"$f":"IF(H101=\"\",\"\",(VLOOKUP(BP7,$F$3:$N$102,3,0)))","v":""},{"$f":"IF(I101=\"\",\"\",(VLOOKUP(BP7,$F$3:$N$102,4,0)))","v":""},{"$f":"IF(L101=\"\",\"\",(VLOOKUP(BP7,$F$3:$N$102,7,0)))","v":""},null,{"$f":"IFERROR(IF(BT7=\"\",\"\",RANK(BT7,$BT$5:$BT$8)),0)","v":""}]
[8,null,null,null,null,6,43,null,null,null,null,null,999,6,{"$f":"IF(X15=\"\",\"\",X15)","v":""},{"$f":"IF(W15=\"\",\"\",W15)","v":""},null,4,null,{"$f":"IF(H6=\"\",\"\",(VLOOKUP(R8,$F$3:$Q$102,3,0)))","v":""},{"$f":"IF(I6=\"\",\"\",(VLOOKUP(R8,$F$3:$N$102,4,0)))","v":""},{"$f":"IF(L6=\"\",\"\",VLOOKUP(R8,$F$3:$N$102,7,0))","v":""},null,{"$f":"IFERROR(IF(W8=\"\",\"\",RANK(W8,$W$5:$W$8)),0)","v":""},1,null,null,20,{"$f":"IF(H22=\"\",\"\",(VLOOKUP(AB8,$F$3:$N$102,3,0)))","v":""},{"$f":"IF(I22=\"\",\"\",(VLOOKUP(AB8,$F$3:$N$102,4,0)))","v":""},{"$f":"IF(L22=\"\",\"\",(VLOOKUP(AB8,$F$3:$N$102,7,0)))","v":""},null,{"$f":"IFERROR(IF(AF8=\"\",\"\",RANK(AF8,$AF$5:$AF$8)),0)","v":""},null,null,36,{"$f":"IF(H38=\"\",\"\",(VLOOKUP(AJ8,$F$3:$N$102,3,0)))","v":""},{"$f":"IF(I38=\"\",\"\",(VLOOKUP(AJ8,$F$3:$N$102,4,0)))","v":""},{"$f":"IF(L38=\"\",\"\",(VLOOKUP(AJ8,$F$3:$N$102,7,0)))","v":""},null,{"$f":"IFERROR(IF(AN8=\"\",\"\",RANK(AN8,$AN$5:$AN$8)),0)","v":""},null,null,52,{"$f":"IF(H54=\"\",\"\",(VLOOKUP(AR8,$F$3:$N$102,3,0)))","v":""},{"$f":"IF(I54=\"\",\"\",(VLOOKUP(AR8,$F$3:$N$102,4,0)))","v":""},{"$f":"IF(L54=\"\",\"\",(VLOOKUP(AR8,$F$3:$N$102,7,0)))","v":""},null,{"$f":"IFERROR(IF(AV8=\"\",\"\",RANK(AV8,$AV$5:$AV$8)),0)","v":""},null,null,68,{"$f":"IF(H70=\"\",\"\",(VLOOKUP(AZ8,$F$3:$N$102,3,0)))","v":""},{"$f":"IF(L70=\"\",\"\",(VLOOKUP(AZ8,$F$3:$N$102,4,0)))","v":""},{"$f":"IF(L70=\"\",\"\",(VLOOKUP(AZ8,$F$3:$N$102,7,0)))","v":""},null,{"$f":"IFERROR(IF(BD8=\"\",\"\",RANK(BD8,$BD$5:$BD$8)),0)","v":""},null,null,84,{"$f":"IF(H86=\"\",\"\",(VLOOKUP(BH8,$F$3:$N$102,3,0)))","v":""},{"$f":"IF(I86=\"\",\"\",(VLOOKUP(BH8,$F$3:$N$102,4,0)))","v":""},{"$f":"IF(L86=\"\",\"\",(VLOOKUP(BH8,$F$3:$N$102,7,0)))","v":""},null,{"$f":"IFERROR(IF(BL8=\"\",\"\",RANK(BL8,$BL$5:$BL$8)),0)","v":""},null,null,100,{"$f":"IF(H102=\"\",\"\",(VLOOKUP(BP8,$F$3:$N$102,3,0)))","v":""},{"$f":"IF(I102=\"\",\"\",(VLOOKUP(BP8,$F$3:$N$102,4,0)))","v":""},{"$f":"IF(L102=\"\",\"\",(VLOOKUP(BP8,$F$3:$N$102,7,0)))","v":""},null,{"$f":"IFERROR(IF(BT8=\"\",\"\",RANK(BT8,$BT$5:$BT$8)),0)","v":""}]
[9,null,null,null,null,7,14,null,null,null,null,null,999,7,{"$f":"IF(X16=\"\",\"\",X16)","v":""},{"$f":"IF(W16=\"\",\"\",W16)","v":""}]
[10,null,null,null,null,8,64,null,null,null,null,null,999,8,{"$f":"IF(X17=\"\",\"\",X17)","v":""},{"$f":"IF(W17=\"\",\"\",W17)","v":""}]
[13,null,null,null,null,9,2,null,null,null,null,null,999,9,{"$f":"IF(X23=\"\",\"\",X23)","v":""},{"$f":"IF(W23=\"\",\"\",W23)","v":""},null,null,null,{"$f":"IF(ISTEXT('Teilnehmer Erfassung'!K2),\"Tisch 2 Rund 1\",IF('Teilnehmer Erfassung'!K2=8,\"Halbfinale 2\",\"Tisch 2 Runde 1\"))","v":"Tisch 2 Rund 1"},null,null,null,null,null,null,null,null,"Tisch 6 Runde 1",null,null,null,null,null,null,null,"Tisch 10 Runde 1",null,null,null,null,null,null,null,"Tisch 14 Runde 1",null,null,null,null,null,null,null,"Tisch 18 Runde 1",null,null,null,null,null,null,null,"Tisch 22 Runde 1"]
[14,null,null,null,null,10,22,null,null,null,null,null,999,10,{"$f":"IF(X24=\"\",\"\",X24)","v":""},{"$f":"IF(W24=\"\",\"\",W24)","v":""}]
[15,null,null,null,null,11,52,null,null,null,null,null,999,11,{"$f":"IF(X25=\"\",\"\",X25)","v":""},{"$f":"IF(W25=\"\",\"\",W25)","v":""},null,null,null,"Vorname","Name","Alter","Punkte","Platzierung",null,null,null,null,"Vorname","Name","Alter","Punkte","Platzierung",null,null,null,"Vorname","Name","Alter","Punkte","Platzierung",null,null,null,"Vorname","Name","Alter","Punkte","Platzierung",null,null,null,"Vorname","Name","Alter","Punkte","Platzierung",null,null,null,"Vorname","Name","Alter","Punkte","Platzierung"]
[16,null,null,null,null,12,36,null,null,null,null,null,999,12,{"$f":"IF(X26=\"\",\"\",X26)","v":""},{"$f":"IF(W26=\"\",\"\",W26)","v":""},null,5,null,{"$f":"IF(H7=\"\",\"\",(VLOOKUP(R14,$F$3:$N$102,3,0)))","v":""},{"$f":"IF(I7=\"\",\"\",(VLOOKUP(R14,$F$3:$N$102,4,0)))","v":""},{"$f":"IF(L7=\"\",\"\",(VLOOKUP(R14,$F$3:$N$102,7,0)))","v":""},null,{"$f":"IFERROR(IF(W14=\"\",\"\",RANK(W14,$W$14:$W$17)),0)","v":""},null,null,null,21,{"$f":"IF(H23=\"\",\"\",(VLOOKUP(AB14,$F$3:$N$102,3,0)))","v":""},{"$f":"IF(I23=\"\",\"\",(VLOOKUP(AB14,$F$3:$N$102,4,0)))","v":""},{"$f":"IF(L23=\"\",\"\",(VLOOKUP(AB14,$F$3:$N$102,7,0)))","v":""},null,{"$f":"IFERROR(IF(AF14=\"\",\"\",RANK(AF14,$AF$14:$AF$17)),0)","v":""},null,null,37,{"$f":"IF(H39=\"\",\"\",(VLOOKUP(AJ14,$F$3:$N$102,3,0)))","v":""},{"$f":"IF(I39=\"\",\"\",(VLOOKUP(AJ14,$F$3:$N$102,4,0)))","v":""},{"$f":"IF(L39=\"\",\"\",(VLOOKUP(AJ14,$F$3:$N$102,7,0)))","v":""},null,{"$f":"IFERROR(IF(AN14=\"\",\"\",RANK(AN14,$AN$14:$AN$17)),0)","v":""},null,null,53,{"$f":"IF(H55=\"\",\"\",(VLOOKUP(AR14,$F$3:$N$102,3,0)))","v":""},{"$f":"IF(I55=\"\",\"\",(VLOOKUP(AR14,$F$3:$N$102,4,0)))","v":""},{"$f":"IF(L55=\"\",\"\",(VLOOKUP(AR14,$F$3:$N$102,7,0)))","v":""},null,{"$f":"IFERROR(IF(AV14=\"\",\"\",RANK(AV14,$AV$14:$AV$17)),0)","v":""},null,null,69,{"$f":"IF(H71=\"\",\"\",(VLOOKUP(AZ14,$F$3:$N$102,3,0)))","v":""},{"$f":"IF(L71=\"\",\"\",(VLOOKUP(AZ14,$F$3:$N$102,4,0)))","v":""},{"$f":"IF(L71=\"\",\"\",(VLOOKUP(AZ14,$F$3:$N$102,7,0)))","v":""},null,{"$f":"IFERROR(IF(BD14=\"\",\"\",RANK(BD14,$BD$14:$BD$17)),0)","v":""},null,null,85,{"$f":"IF(H87=\"\",\"\",(VLOOKUP(BH14,$F$3:$N$102,3,0)))","v":""},{"$f":"IF(I87=\"\",\"\",(VLOOKUP(BH14,$F$3:$N$102,4,0)))","v":""},{"$f":"IF(L87=\"\",\"\",(VLOOKUP(BH14,$F$3:$N$102,7,0)))","v":""},null,{"$f":"IFERROR(IF(BL14=\"\",\"\",RANK(BL14,$BL$14:$BL$17)),0)","v":""}]
[18,null,null,null,null,13,59,null,null,null,null,null,999,13,{"$f":"IF(X32=\"\",\"\",X32)","v":""},{"$f":"IF(W32=\"\",\"\",W32)","v":""},null,6,null,{"$f":"IF(H8=\"\",\"\",(VLOOKUP(R15,$F$3:$N$102,3,0)))","v":""},{"$f":"IF(I8=\"\",\"\",(VLOOKUP(R15,$F$3:$N$102,4,0)))","v":""},{"$f":"IF(L8=\"\",\"\",(VLOOKUP(R15,$F$3:$N$102,7,0)))","v":""},null,{"$f":"IFERROR(IF(W15=\"\",\"\",RANK(W15,$W$14:$W$17)),0)","v":""},null,null,null,22,{"$f":"IF(H24=\"\",\"\",(VLOOKUP(AB15,$F$3:$N$102,3,0)))","v":""},{"$f":"IF(I24=\"\",\"\",(VLOOKUP(AB15,$F$3:$N$102,4,0)))","v":""},{"$f":"IF(L24=\"\",\"\",(VLOOKUP(AB15,$F$3:$N$102,7,0)))","v":""},null,{"$f":"IFERROR(IF(AF15=\"\",\"\",RANK(AF15,$AF$14:$AF$17)),0)","v":""},null,null,38,{"$f":"IF(H40=\"\",\"\",(VLOOKUP(AJ15,$F$3:$N$102,3,0)))","v":""},{"$f":"IF(I40=\"\",\"\",(VLOOKUP(AJ15,$F$3:$N$102,4,0)))","v":""},{"$f":"IF(L40=\"\",\"\",(VLOOKUP(AJ15,$F$3:$N$102,7,0)))","v":""},null,{"$f":"IFERROR(IF(AN15=\"\",\"\",RANK(AN15,$AN$14:$AN$17)),0)","v":""},null,null,54,{"$f":"IF(H56=\"\",\"\",(VLOOKUP(AR15,$F$3:$N$102,3,0)))","v":""},{"$f":"IF(I56=\"\",\"\",(VLOOKUP(AR15,$F$3:$N$102,4,0)))","v":""},{"$f":"IF(L56=\"\",\"\",(VLOOKUP(AR15,$F$3:$N$102,7,0)))","v":""},null,{"$f":"IFERROR(IF(AV15=\"\",\"\",RANK(AV15,$AV$14:$AV$17)),0)","v":""},null,null,70,{"$f":"IF(H72=\"\",\"\",(VLOOKUP(AZ15,$F$3:$N$102,3,0)))","v":""},{"$f":"IF(L72=\"\",\"\",(VLOOKUP(AZ15,$F$3:$N$102,4,0)))","v":""},{"$f":"IF(L72=\"\",\"\",(VLOOKUP(AZ15,$F$3:$N$102,7,0)))","v":""},null,{"$f":"IFERROR(IF(BD15=\"\",\"\",RANK(BD15,$BD$14:$BD$17)),0)","v":""},null,null,86,{"$f":"IF(H88=\"\",\"\",(VLOOKUP(BH15,$F$3:$N$102,3,0)))","v":""},{"$f":"IF(I88=\"\",\"\",(VLOOKUP(BH15,$F$3:$N$102,4,0)))","v":""},{"$f":"IF(L88=\"\",\"\",(VLOOKUP(BH15,$F$3:$N$102,7,0)))","v":""},null,{"$f":"IFERROR(IF(BL15=\"\",\"\",RANK(BL15,$BL$14:$BL$17)),0)","v":""}]
[19,null,null,null,null,14,4,null,null,null,null,null,999,14,{"$f":"IF(X33=\"\",\"\",X33)","v":""},{"$f":"IF(W33=\"\",\"\",W33)","v":""},null,7,null,{"$f":"IF(H9=\"\",\"\",(VLOOKUP(R16,$F$3:$N$102,3,0)))","v":""},{"$f":"IF(I9=\"\",\"\",(VLOOKUP(R16,$F$3:$N$102,4,0)))","v":""},{"$f":"IF(L9=\"\",\"\",(VLOOKUP(R16,$F$3:$N$102,7,0)))","v":""},null,{"$f":"IFERROR(IF(W16=\"\",\"\",RANK(W16,$W$14:$W$17)),0)","v":""},null,null,null,23,{"$f":"IF(H25=\"\",\"\",(VLOOKUP(AB16,$F$3:$N$102,3,0)))","v":""},{"$f":"IF(I25=\"\",\"\",(VLOOKUP(AB16,$F$3:$N$102,4,0)))","v":""},{"$f":"IF(L25=\"\",\"\",(VLOOKUP(AB16,$F$3:$N$102,7,0)))","v":""},null,{"$f":"IFERROR(IF(AF16=\"\",\"\",RANK(AF16,$AF$14:$AF$17)),0)","v":""},null,null,39,{"$f":"IF(H41=\"\",\"\",(VLOOKUP(AJ16,$F$3:$N$102,3,0)))","v":""},{"$f":"IF(I41=\"\",\"\",(VLOOKUP(AJ16,$F$3:$N$102,4,0)))","v":""},{"$f":"IF(L41=\"\",\"\",(VLOOKUP(AJ16,$F$3:$N$102,7,0)))","v":""},null,{"$f":"IFERROR(IF(AN16=\"\",\"\",RANK(AN16,$AN$14:$AN$17)),0)","v":""},null,null,55,{"$f":"IF(H57=\"\",\"\",(VLOOKUP(AR16,$F$3:$N$102,3,0)))","v":""},{"$f":"IF(I57=\"\",\"\",(VLOOKUP(AR16,$F$3:$N$102,4,0)))","v":""},{"$f":"IF(L57=\"\",\"\",(VLOOKUP(AR16,$F$3:$N$102,7,0)))","v":""},null,{"$f":"IFERROR(IF(AV16=\"\",\"\",RANK(AV16,$AV$14:$AV$17)),0)","v":""},null,null,71,{"$f":"IF(H73=\"\",\"\",(VLOOKUP(AZ16,$F$3:$N$102,3,0)))","v":""},{"$f":"IF(L73=\"\",\"\",(VLOOKUP(AZ16,$F$3:$N$102,4,0)))","v":""},{"$f":"IF(L73=\"\",\"\",(VLOOKUP(AZ16,$F$3:$N$102,7,0)))","v":""},null,{"$f":"IFERROR(IF(BD16=\"\",\"\",RANK(BD16,$BD$14:$BD$17)),0)","v":""},null,null,87,{"$f":"IF(H89=\"\",\"\",(VLOOKUP(BH16,$F$3:$N$102,3,0)))","v":""},{"$f":"IF(I89=\"\",\"\",(VLOOKUP(BH16,$F$3:$N$102,4,0)))","v":""},{"$f":"IF(L89=\"\",\"\",(VLOOKUP(BH16,$F$3:$N$102,7,0)))","v":""},null,{"$f":"IFERROR(IF(BL16=\"\",\"\",RANK(BL16,$BL$14:$BL$17)),0)","v":""}]
[22,null,null,null,null,15,16,null,null,null,null,null,999,15,{"$f":"IF(X34=\"\",\"\",X34)","v":""},{"$f":"IF(W34=\"\",\"\",W34)","v":""},null,8,null,{"$f":"IF(H10=\"\",\"\",(VLOOKUP(R17,$F$3:$N$102,3,0)))","v":""},{"$f":"IF(I10=\"\",\"\",(VLOOKUP(R17,$F$3:$N$102,4,0)))","v":""},{"$f":"IF(L10=\"\",\"\",(VLOOKUP(R17,$F$3:$N$102,7,0)))","v":""},null,{"$f":"IFERROR(IF(W17=\"\",\"\",RANK(W17,$W$14:$W$17)),0)","v":""},null,null,null,24,{"$f":"IF(H26=\"\",\"\",(VLOOKUP(AB17,$F$3:$N$102,3,0)))","v":""},{"$f":"IF(I26=\"\",\"\",(VLOOKUP(AB17,$F$3:$N$102,4,0)))","v":""},{"$f":"IF(L26=\"\",\"\",(VLOOKUP(AB17,$F$3:$N$102,7,0)))","v":""},null,{"$f":"IFERROR(IF(AF17=\"\",\"\",RANK(AF17,$AF$14:$AF$17)),0)","v":""},null,null,40,{"$f":"IF(H42=\"\",\"\",(VLOOKUP(AJ17,$F$3:$N$102,3,0)))","v":""},{"$f":"IF(I42=\"\",\"\",(VLOOKUP(AJ17,$F$3:$N$102,4,0)))","v":""},{"$f":"IF(L42=\"\",\"\",(VLOOKUP(AJ17,$F$3:$N$102,7,0)))","v":""},null,{"$f":"IFERROR(IF(AN17=\"\",\"\",RANK(AN17,$AN$14:$AN$17)),0)","v":""},null,null,56,{"$f":"IF(H58=\"\",\"\",(VLOOKUP(AR17,$F$3:$N$102,3,0)))","v":""},{"$f":"IF(I58=\"\",\"\",(VLOOKUP(AR17,$F$3:$N$102,4,0)))","v":""},{"$f":"IF(L58=\"\",\"\",(VLOOKUP(AR17,$F$3:$N$102,7,0)))","v":""},null,{"$f":"IFERROR(IF(AV17=\"\",\"\",RANK(AV17,$AV$14:$AV$17)),0)","v":""},null,null,72,{"$f":"IF(H74=\"\",\"\",(VLOOKUP(AZ17,$F$3:$N$102,3,0)))","v":""},{"$f":"IF(L74=\"\",\"\",(VLOOKUP(AZ17,$F$3:$N$102,4,0)))","v":""},{"$f":"IF(L74=\"\",\"\",(VLOOKUP(AZ17,$F$3:$N$102,7,0)))","v":""},null,{"$f":"IFERROR(IF(BD17=\"\",\"\",RANK(BD17,$BD$14:$BD$17)),0)","v":""},null,null,88,{"$f":"IF(H90=\"\",\"\",(VLOOKUP(BH17,$F$3:$N$102,3,0)))","v":""},{"$f":"IF(I90=\"\",\"\",(VLOOKUP(BH17,$F$3:$N$102,4,0)))","v":""},{"$f":"IF(L90=\"\",\"\",(VLOOKUP(BH17,$F$3:$N$102,7,0)))","v":""},null,{"$f":"IFERROR(IF(BL17=\"\",\"\",RANK(BL17,$BL$14:$BL$17)),0)","v":""}]
[23,null,null,null,null,16,15,null,null,null,null,null,999,16,{"$f":"IF(X35=\"\",\"\",X35)","v":""},{"$f":"IF(W35=\"\",\"\",W35)","v":""}]
[24,null,null,null,null,17,49,null,null,null,null,null,999,17,{"$f":"IF(AG5=\"\",\"\",AG5)","v":""},{"$f":"IF(AF5=\"\",\"\",AF5)","v":""}]
[25,null,null,null,null,18,56,null,null,null,null,null,999,18,{"$f":"IF(AG6=\"\",\"\",AG6)","v":""},{"$f":"IF(AF6=\"\",\"\",AF6)","v":""},null,null,null,"Tisch 3 Runde 1",null,null,null,null,null,null,null,null,"Tisch 7 Runde 1",null,null,null,null,null,null,null,"Tisch 11 Runde 1",null,null,null,null,null,null,null,"Tisch 15 Runde 1",null,null,null,null,null,null,null,"Tisch 19 Runde 1",null,null,null,null,null,null,null,"Tisch 23 Runde 1"]
[27,null,null,null,null,19,58,null,null,null,null,null,999,19,{"$f":"IF(AG7=\"\",\"\",AG7)","v":""},{"$f":"IF(AF7=\"\",\"\",AF7)","v":""}]
[28,null,null,null,null,20,25,null,null,null,null,null,999,20,{"$f":"IF(AG8=\"\",\"\",AG8)","v":""},{"$f":"IF(AF8=\"\",\"\",AF8)","v":""},null,null,null,"Vorname","Name","Alter","Punkte","Platzierung",null,null,null,null,"Vorname","Name","Alter","Punkte","Platzierung",null,null,null,"Vorname","Name","Alter","Punkte","Platzierung",null,null,null,"Vorname","Name","Alter","Punkte","Platzierung",null,null,null,"Vorname","Name","Alter","Punkte","Platzierung",null,null,null,"Vorname","Name","Alter","Punkte","Platzierung"]
[29,null,null,null,null,21,29,null,null,null,null,null,999,21,{"$f":"IF(AG14=\"\",\"\",AG14)","v":""},{"$f":"IF(AF14=\"\",\"\",AF14)","v":""},null,9,null,{"$f":"IF(H11=\"\",\"\",(VLOOKUP(R23,$F$3:$N$102,3,0)))","v":""},{"$f":"IF(I11=\"\",\"\",(VLOOKUP(R23,$F$3:$N$102,4,0)))","v":""},{"$f":"IF(L11=\"\",\"\",(VLOOKUP(R23,$F$3:$N$102,7,0)))","v":""},null,{"$f":"IFERROR(IF(W23=\"\",\"\",RANK(W23,$W$23:$W$26)),0)","v":""},null,null,null,25,{"$f":"IF(H27=\"\",\"\",(VLOOKUP(AB23,$F$3:$N$102,3,0)))","v":""},{"$f":"IF(H27=\"\",\"\",(VLOOKUP(AB23,$F$3:$N$102,4,0)))","v":""},{"$f":"IF(H27=\"\",\"\",(VLOOKUP(AB23,$F$3:$N$102,7,0)))","v":""},null,{"$f":"IFERROR(IF(AF23=\"\",\"\",RANK(AF23,$AF$23:$AF$26)),0)","v":""},null,null,41,{"$f":"IF(H43=\"\",\"\",(VLOOKUP(AJ23,$F$3:$N$102,3,0)))","v":""},{"$f":"IF(I43=\"\",\"\",(VLOOKUP(AJ23,$F$3:$N$102,4,0)))","v":""},{"$f":"IF(L43=\"\",\"\",(VLOOKUP(AJ23,$F$3:$N$102,7,0)))","v":""},null,{"$f":"IFERROR(IF(AN23=\"\",\"\",RANK(AN23,$AN$23:$AN$26)),0)","v":""},null,null,57,{"$f":"IF(H59=\"\",\"\",(VLOOKUP(AR23,$F$3:$N$102,3,0)))","v":""},{"$f":"IF(I59=\"\",\"\",(VLOOKUP(AR23,$F$3:$N$102,4,0)))","v":""},{"$f":"IF(L59=\"\",\"\",(VLOOKUP(AR23,$F$3:$N$102,7,0)))","v":""},null,{"$f":"IFERROR(IF(AV23=\"\",\"\",RANK(AV23,$AV$23:$AV$26)),0)","v":""},null,null,73,{"$f":"IF(H75=\"\",\"\",(VLOOKUP(AZ23,$F$3:$N$102,3,0)))","v":""},{"$f":"IF(L75=\"\",\"\",(VLOOKUP(AZ23,$F$3:$N$102,4,0)))","v":""},{"$f":"IF(L75=\"\",\"\",(VLOOKUP(AZ23,$F$3:$N$102,7,0)))","v":""},null,{"$f":"IFERROR(IF(BD23=\"\",\"\",RANK(BD23,$BD$23:$BD$26)),0)","v":""},null,null,89,{"$f":"IF(H91=\"\",\"\",(VLOOKUP(BH23,$F$3:$N$102,3,0)))","v":""},{"$f":"IF(I91=\"\",\"\",(VLOOKUP(BH23,$F$3:$N$102,4,0)))","v":""},{"$f":"IF(L91=\"\",\"\",(VLOOKUP(BH23,$F$3:$N$102,7,0)))","v":""},null,{"$f":"IFERROR(IF(BL23=\"\",\"\",RANK(BL23,$BL$23:$BL$26)),0)","v":""}]
[30,null,null,null,null,22,53,null,null,null,null,null,999,22,{"$f":"IF(AG15=\"\",\"\",AG15)","v":""},{"$f":"IF(AF15=\"\",\"\",AF15)","v":""},null,10,null,{"$f":"IF(H12=\"\",\"\",(VLOOKUP(R24,$F$3:$N$102,3,0)))","v":""},{"$f":"IF(I12=\"\",\"\",(VLOOKUP(R24,$F$3:$N$102,4,0)))","v":""},{"$f":"IF(L12=\"\",\"\",(VLOOKUP(R24,$F$3:$N$102,7,0)))","v":""},null,{"$f":"IFERROR(IF(W24=\"\",\"\",RANK(W24,$W$23:$W$26)),0)","v":""},null,null,null,26,{"$f":"IF(H28=\"\",\"\",(VLOOKUP(AB24,$F$3:$N$102,3,0)))","v":""},{"$f":"IF(H28=\"\",\"\",(VLOOKUP(AB24,$F$3:$N$102,4,0)))","v":""},{"$f":"IF(H28=\"\",\"\",(VLOOKUP(AB24,$F$3:$N$102,7,0)))","v":""},null,{"$f":"IFERROR(IF(AF24=\"\",\"\",RANK(AF24,$AF$23:$AF$26)),0)","v":""},null,null,42,{"$f":"IF(H44=\"\",\"\",(VLOOKUP(AJ24,$F$3:$N$102,3,0)))","v":""},{"$f":"IF(I44=\"\",\"\",(VLOOKUP(AJ24,$F$3:$N$102,4,0)))","v":""},{"$f":"IF(L44=\"\",\"\",(VLOOKUP(AJ24,$F$3:$N$102,7,0)))","v":""},null,{"$f":"IFERROR(IF(AN24=\"\",\"\",RANK(AN24,$AN$23:$AN$26)),0)","v":""},null,null,58,{"$f":"IF(H60=\"\",\"\",(VLOOKUP(AR24,$F$3:$N$102,3,0)))","v":""},{"$f":"IF(I60=\"\",\"\",(VLOOKUP(AR24,$F$3:$N$102,4,0)))","v":""},{"$f":"IF(L60=\"\",\"\",(VLOOKUP(AR24,$F$3:$N$102,7,0)))","v":""},null,{"$f":"IFERROR(IF(AV24=\"\",\"\",RANK(AV24,$AV$23:$AV$26)),0)","v":""},null,null,74,{"$f":"IF(H76=\"\",\"\",(VLOOKUP(AZ24,$F$3:$N$102,3,0)))","v":""},{"$f":"IF(L76=\"\",\"\",(VLOOKUP(AZ24,$F$3:$N$102,4,0)))","v":""},{"$f":"IF(L76=\"\",\"\",(VLOOKUP(AZ24,$F$3:$N$102,7,0)))","v":""},null,{"$f":"IFERROR(IF(BD24=\"\",\"\",RANK(BD24,$BD$23:$BD$26)),0)","v":""},null,null,90,{"$f":"IF(H92=\"\",\"\",(VLOOKUP(BH24,$F$3:$N$102,3,0)))","v":""},{"$f":"IF(I92=\"\",\"\",(VLOOKUP(BH24,$F$3:$N$102,4,0)))","v":""},{"$f":"IF(L92=\"\",\"\",(VLOOKUP(BH24,$F$3:$N$102,7,0)))","v":""},null,{"$f":"IFERROR(IF(BL24=\"\",\"\",RANK(BL24,$BL$23:$BL$26)),0)","v":""}]
[33,null,null,null,null,23,28,null,null,null,null,null,999,23,{"$f":"IF(AG16=\"\",\"\",AG16)","v":""},{"$f":"IF(AF16=\"\",\"\",AF16)","v":""},null,11,null,{"$f":"IF(H13=\"\",\"\",(VLOOKUP(R25,$F$3:$N$102,3,0)))","v":""},{"$f":"IF(I13=\"\",\"\",(VLOOKUP(R25,$F$3:$N$102,4,0)))","v":""},{"$f":"IF(L13=\"\",\"\",(VLOOKUP(R25,$F$3:$N$102,7,0)))","v":""},null,{"$f":"IFERROR(IF(W25=\"\",\"\",RANK(W25,$W$23:$W$26)),0)","v":""},null,null,null,27,{"$f":"IF(H29=\"\",\"\",(VLOOKUP(AB25,$F$3:$N$102,3,0)))","v":""},{"$f":"IF(H29=\"\",\"\",(VLOOKUP(AB25,$F$3:$N$102,4,0)))","v":""},{"$f":"IF(H29=\"\",\"\",(VLOOKUP(AB25,$F$3:$N$102,7,0)))","v":""},null,{"$f":"IFERROR(IF(AF25=\"\",\"\",RANK(AF25,$AF$23:$AF$26)),0)","v":""},null,null,43,{"$f":"IF(H45=\"\",\"\",(VLOOKUP(AJ25,$F$3:$N$102,3,0)))","v":""},{"$f":"IF(I45=\"\",\"\",(VLOOKUP(AJ25,$F$3:$N$102,4,0)))","v":""},{"$f":"IF(L45=\"\",\"\",(VLOOKUP(AJ25,$F$3:$N$102,7,0)))","v":""},null,{"$f":"IFERROR(IF(AN25=\"\",\"\",RANK(AN25,$AN$23:$AN$26)),0)","v":""},null,null,59,{"$f":"IF(H61=\"\",\"\",(VLOOKUP(AR25,$F$3:$N$102,3,0)))","v":""},{"$f":"IF(I61=\"\",\"\",(VLOOKUP(AR25,$F$3:$N$102,4,0)))","v":""},{"$f":"IF(L61=\"\",\"\",(VLOOKUP(AR25,$F$3:$N$102,7,0)))","v":""},null,{"$f":"IFERROR(IF(AV25=\"\",\"\",RANK(AV25,$AV$23:$AV$26)),0)","v":""},null,null,75,{"$f":"IF(H77=\"\",\"\",(VLOOKUP(AZ25,$F$3:$N$102,3,0)))","v":""},{"$f":"IF(L77=\"\",\"\",(VLOOKUP(AZ25,$F$3:$N$102,4,0)))","v":""},{"$f":"IF(L77=\"\",\"\",(VLOOKUP(AZ25,$F$3:$N$102,7,0)))","v":""},null,{"$f":"IFERROR(IF(BD25=\"\",\"\",RANK(BD25,$BD$23:$BD$26)),0)","v":""},null,null,91,{"$f":"IF(H93=\"\",\"\",(VLOOKUP(BH25,$F$3:$N$102,3,0)))","v":""},{"$f":"IF(I93=\"\",\"\",(VLOOKUP(BH25,$F$3:$N$102,4,0)))","v":""},{"$f":"IF(L93=\"\",\"\",(VLOOKUP(BH25,$F$3:$N$102,7,0)))","v":""},null,{"$f":"IFERROR(IF(BL25=\"\",\"\",RANK(BL25,$BL$23:$BL$26)),0)","v":""}]
[34,null,null,null,null,24,37,null,null,null,null,null,999,24,{"$f":"IF(AG17=\"\",\"\",AG17)","v":""},{"$f":"IF(AF17=\"\",\"\",AF17)","v":""},null,12,null,{"$f":"IF(H14=\"\",\"\",(VLOOKUP(R26,$F$3:$N$102,3,0)))","v":""},{"$f":"IF(I14=\"\",\"\",(VLOOKUP(R26,$F$3:$N$102,4,0)))","v":""},{"$f":"IF(L14=\"\",\"\",(VLOOKUP(R26,$F$3:$N$102,7,0)))","v":""},null,{"$f":"IFERROR(IF(W26=\"\",\"\",RANK(W26,$W$23:$W$26)),0)","v":""},null,null,null,28,{"$f":"IF(H30=\"\",\"\",(VLOOKUP(AB26,$F$3:$N$102,3,0)))","v":""},{"$f":"IF(H30=\"\",\"\",(VLOOKUP(AB26,$F$3:$N$102,4,0)))","v":""},{"$f":"IF(H30=\"\",\"\",(VLOOKUP(AB26,$F$3:$N$102,7,0)))","v":""},null,{"$f":"IFERROR(IF(AF26=\"\",\"\",RANK(AF26,$AF$23:$AF$26)),0)","v":""},null,null,44,{"$f":"IF(H46=\"\",\"\",(VLOOKUP(AJ26,$F$3:$N$102,3,0)))","v":""},{"$f":"IF(I46=\"\",\"\",(VLOOKUP(AJ26,$F$3:$N$102,4,0)))","v":""},{"$f":"IF(L46=\"\",\"\",(VLOOKUP(AJ26,$F$3:$N$102,7,0)))","v":""},null,{"$f":"IFERROR(IF(AN26=\"\",\"\",RANK(AN26,$AN$23:$AN$26)),0)","v":""},null,null,60,{"$f":"IF(H62=\"\",\"\",(VLOOKUP(AR26,$F$3:$N$102,3,0)))","v":""},{"$f":"IF(I62=\"\",\"\",(VLOOKUP(AR26,$F$3:$N$102,4,0)))","v":""},{"$f":"IF(L62=\"\",\"\",(VLOOKUP(AR26,$F$3:$N$102,7,0)))","v":""},null,{"$f":"IFERROR(IF(AV26=\"\",\"\",RANK(AV26,$AV$23:$AV$26)),0)","v":""},null,null,76,{"$f":"IF(H78=\"\",\"\",(VLOOKUP(AZ26,$F$3:$N$102,3,0)))","v":""},{"$f":"IF(L78=\"\",\"\",(VLOOKUP(AZ26,$F$3:$N$102,4,0)))","v":""},{"$f":"IF(L78=\"\",\"\",(VLOOKUP(AZ26,$F$3:$N$102,7,0)))","v":""},null,{"$f":"IFERROR(IF(BD26=\"\",\"\",RANK(BD26,$BD$23:$BD$26)),0)","v":""},null,null,92,{"$f":"IF(H94=\"\",\"\",(VLOOKUP(BH26,$F$3:$N$102,3,0)))","v":""},{"$f":"IF(I94=\"\",\"\",(VLOOKUP(BH26,$F$3:$N$102,4,0)))","v":""},{"$f":"IF(L94=\"\",\"\",(VLOOKUP(BH26,$F$3:$N$102,7,0)))","v":""},null,{"$f":"IFERROR(IF(BL26=\"\",\"\",RANK(BL26,$BL$23:$BL$26)),0)","v":""}]
[35,null,null,null,null,25,3,null,null,null,null,null,999,25,{"$f":"IF(AG23=\"\",\"\",AG23)","v":""},{"$f":"IF(AF23=\"\",\"\",AF23)","v":""}]
[36,null,null,null,null,26,33,null,null,null,null,null,999,26,{"$f":"IF(AG24=\"\",\"\",AG24)","v":""},{"$f":"IF(AF24=\"\",\"\",AF24)","v":""}]
[38,null,null,null,null,27,46,null,null,null,null,null,999,27,{"$f":"IF(AG25=\"\",\"\",AG25)","v":""},{"$f":"IF(AF25=\"\",\"\",AF25)","v":""},null,null,null,"Tisch 4 Runde 1",null,null,null,null,null,null,null,null,"Tisch 8 Runde 1",null,null,null,null,null,null,null,"Tisch 12 Runde 1",null,null,null,null,null,null,null,"Tisch 16 Runde 1",null,null,null,null,null,null,null,"Tisch 20 Runde 1",null,null,null,null,null,null,null,"Tisch 24 Runde 1"]
[40,null,null,null,null,28,38,null,null,null,null,null,999,28,{"$f":"IF(AG26=\"\",\"\",AG26)","v":""},{"$f":"IF(AF26=\"\",\"\",AF26)","v":""}]
[42,null,null,null,null,29,54,null,null,null,null,null,999,29,{"$f":"IF(AG32=\"\",\"\",AG32)","v":""},{"$f":"IF(AF32=\"\",\"\",AF32)","v":""},null,null,null,"Vorname","Name","Alter","Punkte","Platzierung",null,null,null,null,"Vorname","Name","Alter","Punkte","Platzierung",null,null,null,"Vorname","Name","Alter","Punkte","Platzierung",null,null,null,"Vorname","Name","Alter","Punkte","Platzierung",null,null,null,"Vorname","Name","Alter","Punkte","Platzierung",null,null,null,"Vorname","Name","Alter","Punkte","Platzierung"]
[45,null,null,null,null,30,21,null,null,null,null,null,999,30,{"$f":"IF(AG33=\"\",\"\",AG33)","v":""},{"$f":"IF(AF33=\"\",\"\",AF33)","v":""},null,13,null,{"$f":"IF(H15=\"\",\"\",(VLOOKUP(R32,$F$3:$N$102,3,0)))","v":""},{"$f":"IF(I15=\"\",\"\",(VLOOKUP(R32,$F$3:$N$102,4,0)))","v":""},{"$f":"IF(L15=\"\",\"\",(VLOOKUP(R32,$F$3:$N$102,7,0)))","v":""},null,{"$f":"IFERROR(IF(W32=\"\",\"\",RANK(W32,$W$32:$W$35)),0)","v":""},null,null,null,29,{"$f":"IF(H31=\"\",\"\",(VLOOKUP(AB32,$F$3:$N$102,3,0)))","v":""},{"$f":"IF(H31=\"\",\"\",(VLOOKUP(AB32,$F$3:$N$102,4,0)))","v":""},{"$f":"IF(H31=\"\",\"\",(VLOOKUP(AB32,$F$3:$N$102,7,0)))","v":""},null,{"$f":"IFERROR(IF(AF32=\"\",\"\",RANK(AF32,$AF$32:$AF$35)),0)","v":""},null,null,45,{"$f":"IF(H47=\"\",\"\",(VLOOKUP(AJ32,$F$3:$N$102,3,0)))","v":""},{"$f":"IF(I47=\"\",\"\",(VLOOKUP(AJ32,$F$3:$N$102,4,0)))","v":""},{"$f":"IF(L47=\"\",\"\",(VLOOKUP(AJ32,$F$3:$N$102,7,0)))","v":""},null,{"$f":"IFERROR(IF(AN32=\"\",\"\",RANK(AN32,$AN$32:$AN$35)),0)","v":""},null,null,61,{"$f":"IF(H63=\"\",\"\",(VLOOKUP(AR32,$F$3:$N$102,3,0)))","v":""},{"$f":"IF(I63=\"\",\"\",(VLOOKUP(AR32,$F$3:$N$102,4,0)))","v":""},{"$f":"IF(L63=\"\",\"\",(VLOOKUP(AR32,$F$3:$N$102,7,0)))","v":""},null,{"$f":"IFERROR(IF(AV32=\"\",\"\",RANK(AV32,$AV$32:$AV$35)),0)","v":""},null,null,77,{"$f":"IF(H79=\"\",\"\",(VLOOKUP(AZ32,$F$3:$N$102,3,0)))","v":""},{"$f":"IF(L79=\"\",\"\",(VLOOKUP(AZ32,$F$3:$N$102,4,0)))","v":""},{"$f":"IF(L79=\"\",\"\",(VLOOKUP(AZ32,$F$3:$N$102,7,0)))","v":""},null,{"$f":"IFERROR(IF(BD32=\"\",\"\",RANK(BD32,$BD$32:$BD$35)),0)","v":""},null,null,93,{"$f":"IF(H95=\"\",\"\",(VLOOKUP(BH32,$F$3:$N$102,3,0)))","v":""},{"$f":"IF(I95=\"\",\"\",(VLOOKUP(BH32,$F$3:$N$102,4,0)))","v":""},{"$f":"IF(L95=\"\",\"\",(VLOOKUP(BH32,$F$3:$N$102,7,0)))","v":""},null,{"$f":"IFERROR(IF(BL32=\"\",\"\",RANK(BL32,$BL$32:$BL$35)),0)","v":""}]
[48,null,null,null,null,31,50,null,null,null,null,null,999,31,{"$f":"IF(AG34=\"\",\"\",AG34)","v":""},{"$f":"IF(AF34=\"\",\"\",AF34)","v":""},null,14,null,{"$f":"IF(H16=\"\",\"\",(VLOOKUP(R33,$F$3:$N$102,3,0)))","v":""},{"$f":"IF(I16=\"\",\"\",(VLOOKUP(R33,$F$3:$N$102,4,0)))","v":""},{"$f":"IF(L16=\"\",\"\",(VLOOKUP(R33,$F$3:$N$102,7,0)))","v":""},null,{"$f":"IFERROR(IF(W33=\"\",\"\",RANK(W33,$W$32:$W$35)),0)","v":""},null,null,null,30,{"$f":"IF(H32=\"\",\"\",(VLOOKUP(AB33,$F$3:$N$102,3,0)))","v":""},{"$f":"IF(H32=\"\",\"\",(VLOOKUP(AB33,$F$3:$N$102,4,0)))","v":""},{"$f":"IF(H32=\"\",\"\",(VLOOKUP(AB33,$F$3:$N$102,7,0)))","v":""},null,{"$f":"IFERROR(IF(AF33=\"\",\"\",RANK(AF33,$AF$32:$AF$35)),0)","v":""},null,null,46,{"$f":"IF(H48=\"\",\"\",(VLOOKUP(AJ33,$F$3:$N$102,3,0)))","v":""},{"$f":"IF(I48=\"\",\"\",(VLOOKUP(AJ33,$F$3:$N$102,4,0)))","v":""},{"$f":"IF(L48=\"\",\"\",(VLOOKUP(AJ33,$F$3:$N$102,7,0)))","v":""},null,{"$f":"IFERROR(IF(AN33=\"\",\"\",RANK(AN33,$AN$32:$AN$35)),0)","v":""},null,null,62,{"$f":"IF(H64=\"\",\"\",(VLOOKUP(AR33,$F$3:$N$102,3,0)))","v":""},{"$f":"IF(I64=\"\",\"\",(VLOOKUP(AR33,$F$3:$N$102,4,0)))","v":""},{"$f":"IF(L64=\"\",\"\",(VLOOKUP(AR33,$F$3:$N$102,7,0)))","v":""},null,{"$f":"IFERROR(IF(AV33=\"\",\"\",RANK(AV33,$AV$32:$AV$35)),0)","v":""},null,null,78,{"$f":"IF(H80=\"\",\"\",(VLOOKUP(AZ33,$F$3:$N$102,3,0)))","v":""},{"$f":"IF(L80=\"\",\"\",(VLOOKUP(AZ33,$F$3:$N$102,4,0)))","v":""},{"$f":"IF(L80=\"\",\"\",(VLOOKUP(AZ33,$F$3:$N$102,7,0)))","v":""},null,{"$f":"IFERROR(IF(BD33=\"\",\"\",RANK(BD33,$BD$32:$BD$35)),0)","v":""},null,null,94,{"$f":"IF(H96=\"\",\"\",(VLOOKUP(BH33,$F$3:$N$102,3,0)))","v":""},{"$f":"IF(I96=\"\",\"\",(VLOOKUP(BH33,$F$3:$N$102,4,0)))","v":""},{"$f":"IF(L96=\"\",\"\",(VLOOKUP(BH33,$F$3:$N$102,7,0)))","v":""},null,{"$f":"IFERROR(IF(BL33=\"\",\"\",RANK(BL33,$BL$32:$BL$35)),0)","v":""}]
[49,null,null,null,null,32,65,null,null,null,null,null,999,32,{"$f":"IF(AG35=\"\",\"\",AG35)","v":""},{"$f":"IF(AF35=\"\",\"\",AF35)","v":""},null,15,null,{"$f":"IF(H17=\"\",\"\",(VLOOKUP(R34,$F$3:$N$102,3,0)))","v":""},{"$f":"IF(I17=\"\",\"\",(VLOOKUP(R34,$F$3:$N$102,4,0)))","v":""},{"$f":"IF(L17=\"\",\"\",(VLOOKUP(R34,$F$3:$N$102,7,0)))","v":""},null,{"$f":"IFERROR(IF(W34=\"\",\"\",RANK(W34,$W$32:$W$35)),0)","v":""},null,null,null,31,{"$f":"IF(H33=\"\",\"\",(VLOOKUP(AB34,$F$3:$N$102,3,0)))","v":""},{"$f":"IF(H33=\"\",\"\",(VLOOKUP(AB34,$F$3:$N$102,4,0)))","v":""},{"$f":"IF(H33=\"\",\"\",(VLOOKUP(AB34,$F$3:$N$102,7,0)))","v":""},null,{"$f":"IFERROR(IF(AF34=\"\",\"\",RANK(AF34,$AF$32:$AF$35)),0)","v":""},null,null,47,{"$f":"IF(H49=\"\",\"\",(VLOOKUP(AJ34,$F$3:$N$102,3,0)))","v":""},{"$f":"IF(I49=\"\",\"\",(VLOOKUP(AJ34,$F$3:$N$102,4,0)))","v":""},{"$f":"IF(L49=\"\",\"\",(VLOOKUP(AJ34,$F$3:$N$102,7,0)))","v":""},null,{"$f":"IFERROR(IF(AN34=\"\",\"\",RANK(AN34,$AN$32:$AN$35)),0)","v":""},null,null,63,{"$f":"IF(H65=\"\",\"\",(VLOOKUP(AR34,$F$3:$N$102,3,0)))","v":""},{"$f":"IF(I65=\"\",\"\",(VLOOKUP(AR34,$F$3:$N$102,4,0)))","v":""},{"$f":"IF(L65=\"\",\"\",(VLOOKUP(AR34,$F$3:$N$102,7,0)))","v":""},null,{"$f":"IFERROR(IF(AV34=\"\",\"\",RANK(AV34,$AV$32:$AV$35)),0)","v":""},null,null,79,{"$f":"IF(H81=\"\",\"\",(VLOOKUP(AZ34,$F$3:$N$102,3,0)))","v":""},{"$f":"IF(L81=\"\",\"\",(VLOOKUP(AZ34,$F$3:$N$102,4,0)))","v":""},{"$f":"IF(L81=\"\",\"\",(VLOOKUP(AZ34,$F$3:$N$102,7,0)))","v":""},null,{"$f":"IFERROR(IF(BD34=\"\",\"\",RANK(BD34,$BD$32:$BD$35)),0)","v":""},null,null,95,{"$f":"IF(H97=\"\",\"\",(VLOOKUP(BH34,$F$3:$N$102,3,0)))","v":""},{"$f":"IF(I97=\"\",\"\",(VLOOKUP(BH34,$F$3:$N$102,4,0)))","v":""},{"$f":"IF(L97=\"\",\"\",(VLOOKUP(BH34,$F$3:$N$102,7,0)))","v":""},null,{"$f":"IFERROR(IF(BL34=\"\",\"\",RANK(BL34,$BL$32:$BL$35)),0)","v":""}]
[50,null,null,null,null,33,63,null,null,null,null,null,{"$f":"IF(H35>\"\",A35,999)","v":999},33,{"$f":"IF(AO5=\"\",\"\",AO5)","v":""},{"$f":"IF(AN5=\"\",\"\",AN5)","v":""},null,16,null,{"$f":"IF(H18=\"\",\"\",(VLOOKUP(R35,$F$3:$N$102,3,0)))","v":""},{"$f":"IF(I18=\"\",\"\",(VLOOKUP(R35,$F$3:$N$102,4,0)))","v":""},{"$f":"IF(L18=\"\",\"\",(VLOOKUP(R35,$F$3:$N$102,7,0)))","v":""},null,{"$f":"IFERROR(IF(W35=\"\",\"\",RANK(W35,$W$32:$W$35)),0)","v":""},null,null,null,32,{"$f":"IF(H34=\"\",\"\",(VLOOKUP(AB35,$F$3:$N$102,3,0)))","v":""},{"$f":"IF(H34=\"\",\"\",(VLOOKUP(AB35,$F$3:$N$102,4,0)))","v":""},{"$f":"IF(H34=\"\",\"\",(VLOOKUP(AB35,$F$3:$N$102,7,0)))","v":""},null,{"$f":"IFERROR(IF(AF35=\"\",\"\",RANK(AF35,$AF$32:$AF$35)),0)","v":""},null,null,48,{"$f":"IF(H50=\"\",\"\",(VLOOKUP(AJ35,$F$3:$N$102,3,0)))","v":""},{"$f":"IF(I50=\"\",\"\",(VLOOKUP(AJ35,$F$3:$N$102,4,0)))","v":""},{"$f":"IF(L50=\"\",\"\",(VLOOKUP(AJ35,$F$3:$N$102,7,0)))","v":""},null,{"$f":"IFERROR(IF(AN35=\"\",\"\",RANK(AN35,$AN$32:$AN$35)),0)","v":""},null,null,64,{"$f":"IF(H66=\"\",\"\",(VLOOKUP(AR35,$F$3:$N$102,3,0)))","v":""},{"$f":"IF(I66=\"\",\"\",(VLOOKUP(AR35,$F$3:$N$102,4,0)))","v":""},{"$f":"IF(L66=\"\",\"\",(VLOOKUP(AR35,$F$3:$N$102,7,0)))","v":""},null,{"$f":"IFERROR(IF(AV35=\"\",\"\",RANK(AV35,$AV$32:$AV$35)),0)","v":""},null,null,80,{"$f":"IF(H82=\"\",\"\",(VLOOKUP(AZ35,$F$3:$N$102,3,0)))","v":""},{"$f":"IF(L82=\"\",\"\",(VLOOKUP(AZ35,$F$3:$N$102,4,0)))","v":""},{"$f":"IF(L82=\"\",\"\",(VLOOKUP(AZ35,$F$3:$N$102,7,0)))","v":""},null,{"$f":"IFERROR(IF(BD35=\"\",\"\",RANK(BD35,$BD$32:$BD$35)),0)","v":""},null,null,96,{"$f":"IF(H98=\"\",\"\",(VLOOKUP(BH35,$F$3:$N$102,3,0)))","v":""},{"$f":"IF(I98=\"\",\"\",(VLOOKUP(BH35,$F$3:$N$102,4,0)))","v":""},{"$f":"IF(L98=\"\",\"\",(VLOOKUP(BH35,$F$3:$N$102,7,0)))","v":""},null,{"$f":"IFERROR(IF(BL35=\"\",\"\",RANK(BL35,$BL$32:$BL$35)),0)","v":""}]
[51,null,null,null,null,34,31,null,null,null,null,null,999,34,{"$f":"IF(AO6=\"\",\"\",AO6)","v":""},{"$f":"IF(AN6=\"\",\"\",AN6)","v":""}]
[52,null,null,null,null,35,6,null,null,null,null,null,999,35,{"$f":"IF(AO7=\"\",\"\",AO7)","v":""},{"$f":"IF(AN7=\"\",\"\",AN7)","v":""}]
[53,null,null,null,null,36,67,null,null,null,null,null,999,36,{"$f":"IF(AO8=\"\",\"\",AO8)","v":""},{"$f":"IF(AN8=\"\",\"\",AN8)","v":""}]
[54,null,null,null,null,37,47,null,null,null,null,null,999,37,{"$f":"IF(AO14=\"\",\"\",AO14)","v":""},{"$f":"IF(AN14=\"\",\"\",AN14)","v":""}]
[55,null,null,null,null,38,39,null,null,null,null,null,999,38,{"$f":"IF(AO15=\"\",\"\",AO15)","v":""},{"$f":"IF(AN15=\"\",\"\",AN15)","v":""},null,null,null,{"$f":"IF(AND(T5>\"\",OR(W5=\"\",W6=\"\",W7=\"\",W8=\"\")),AH1,IF(AND(T14>\"\",OR(W14=\"\",W15=\"\",W16=\"\",W17=\"\")),AH1,IF(AND(T23>\"\",OR(W23=\"\",W24=\"\",W25=\"\",W26=\"\")),AH1,IF(AND(T32>\"\",OR(W32=\"\",W33=\"\",W34=\"\",W35=\"\")),AH1,IF(AND(AC5>\"\",OR(AF5=\"\",AF6=\"\",AF7=\"\",AF8=\"\")),AH1,IF(AND(AC14>\"\",OR(AF14=\"\",AF15=\"\",AF16=\"\",AF17=\"\")),AH1,IF(AND(AC23>\"\",OR(AF23=\"\",AF24=\"\",AF25=\"\",AF26=\"\")),AH1,IF(AND(AC32>\"\",OR(AF32=\"\",AF33=\"\",AF34=\"\",AF35=\"\")),AH1,IF(AND(AK5>\"\",OR(AN5=\"\",AN6=\"\",AN7=\"\",AN8=\"\")),AH1,IF(AND(AK14>\"\",OR(AN14=\"\",AN15=\"\",AN16=\"\",AN17=\"\")),AH1,IF(AND(AK23>\"\",OR(AN23=\"\",AN24=\"\",AN25=\"\",AN26=\"\")),AH1,IF(AND(AK32>\"\",OR(AN32=\"\",AN33=\"\",AN34=\"\",AN35=\"\")),AH1,IF(AND(AS5>\"\",OR(AV5=\"\",AV6=\"\",AV7=\"\",AV8=\"\")),AH1,IF(AND(AS14>\"\",OR(AV14=\"\",AV15=\"\",AV16=\"\",AV17=\"\")),AH1,IF(AND(AS23>\"\",OR(AV23=\"\",AV24=\"\",AV25=\"\",AV26=\"\")),AH1,IF(AND(AS32>\"\",OR(AV32=\"\",AV33=\"\",AV34=\"\",AV35=\"\")),AH1,IF(AND(BA5>\"\",OR(BD5=\"\",BD6=\"\",BD7=\"\",BD8=\"\")),AH1,IF(AND(BA14>\"\",OR(BD14=\"\",BD15=\"\",BD16=\"\",BD17=\"\")),AH1,IF(AND(BA23>\"\",OR(BD23=\"\",BD24=\"\",BD25=\"\",BD26=\"\")),AH1,IF(AND(BA32>\"\",OR(BD32=\"\",BD33=\"\",BD34=\"\",BD35=\"\")),AH1,IF(AND(BI5>\"\",OR(BL5=\"\",BL6=\"\",BL7=\"\",BL8=\"\")),AH1,IF(AND(BI14>\"\",OR(BL14=\"\",BL15=\"\",BL16=\"\",BL17=\"\")),AH1,IF(AND(BI23>\"\",OR(BL23=\"\",BL24=\"\",BL25=\"\",BL26=\"\")),AH1,IF(AND(BI32>\"\",OR(BL32=\"\",BL33=\"\",BL34=\"\",BL35=\"\")),AH1,IF(AND(BQ32>\"\",OR(BT32=\"\",BT33=\"\",BT34=\"\",BT35=\"\")),AH1,IF(AND(P7<>\"\",H7=\"\"),AH2,IF(AND(P8<>\"\",H8=\"\"),AH2,IF(AND(P9<>\"\",H9=\"\"),AH2,IF(AND(P10<>\"\",H10=\"\"),AH2,AK1)))))))))))))))))))))))))))))","v":"Eingabe o.k."},null,null,null,null,null,null,null,null,null,null,null,null,null,null,null,null,{"$f":"IF(AND(T5>\"\",OR(W5=\"\",W6=\"\",W7=\"\",W8=\"\")),AH1,IF(AND(T14>\"\",OR(W14=\"\",W15=\"\",W16=\"\",W17=\"\")),AH1,IF(AND(T23>\"\",OR(W23=\"\",W24=\"\",W25=\"\",W26=\"\")),AH1,IF(AND(T32>\"\",OR(W32=\"\",W33=\"\",W34=\"\",W35=\"\")),AH1,IF(AND(AC5>\"\",OR(AF5=\"\",AF6=\"\",AF7=\"\",AF8=\"\")),AH1,IF(AND(AC14>\"\",OR(AF14=\"\",AF15=\"\",AF16=\"\",AF17=\"\")),AH1,IF(AND(AC23>\"\",OR(AF23=\"\",AF24=\"\",AF25=\"\",AF26=\"\")),AH1,IF(AND(AC32>\"\",OR(AF32=\"\",AF33=\"\",AF34=\"\",AF35=\"\")),AH1,IF(AND(AK5>\"\",OR(AN5=\"\",AN6=\"\",AN7=\"\",AN8=\"\")),AH1,IF(AND(AK14>\"\",OR(AN14=\"\",AN15=\"\",AN16=\"\",AN17=\"\")),AH1,IF(AND(AK23>\"\",OR(AN23=\"\",AN24=\"\",AN25=\"\",AN26=\"\")),AH1,IF(AND(AK32>\"\",OR(AN32=\"\",AN33=\"\",AN34=\"\",AN35=\"\")),AH1,IF(AND(AS5>\"\",OR(AV5=\"\",AV6=\"\",AV7=\"\",AV8=\"\")),AH1,IF(AND(AS14>\"\",OR(AV14=\"\",AV15=\"\",AV16=\"\",AV17=\"\")),AH1,IF(AND(AS23>\"\",OR(AV23=\"\",AV24=\"\",AV25=\"\",AV26=\"\")),AH1,IF(AND(AS32>\"\",OR(AV32=\"\",AV33=\"\",AV34=\"\",AV35=\"\")),AH1,IF(AND(BA5>\"\",OR(BD5=\"\",BD6=\"\",BD7=\"\",BD8=\"\")),AH1,IF(AND(BA14>\"\",OR(BD14=\"\",BD15=\"\",BD16=\"\",BD17=\"\")),AH1,IF(AND(BA23>\"\",OR(BD23=\"\",BD24=\"\",BD25=\"\",BD26=\"\")),AH1,IF(AND(BA32>\"\",OR(BD32=\"\",BD33=\"\",BD34=\"\",BD35=\"\")),AH1,IF(AND(BI5>\"\",OR(BL5=\"\",BL6=\"\",BL7=\"\",BL8=\"\")),AH1,IF(AND(BI14>\"\",OR(BL14=\"\",BL15=\"\",BL16=\"\",BL17=\"\")),AH1,IF(AND(BI23>\"\",OR(BL23=\"\",BL24=\"\",BL25=\"\",BL26=\"\")),AH1,IF(AND(BI32>\"\",OR(BL32=\"\",BL33=\"\",BL34=\"\",BL35=\"\")),AH1,IF(AND(BQ32>\"\",OR(BT32=\"\",BT33=\"\",BT34=\"\",BT35=\"\")),AH1,IF(AND(P7<>\"\",H7=\"\"),AH2,IF(AND(P8<>\"\",H8=\"\"),AH2,IF(AND(P9<>\"\",H9=\"\"),AH2,IF(AND(P10<>\"\",H10=\"\"),AH2,AK1)))))))))))))))))))))))))))))","v":"Eingabe o.k."},null,null,null,null,null,null,null,null,null,null,null,null,null,null,null,{"$f":"IF(AND(T5>\"\",OR(W5=\"\",W6=\"\",W7=\"\",W8=\"\")),AH1,IF(AND(T14>\"\",OR(W14=\"\",W15=\"\",W16=\"\",W17=\"\")),AH1,IF(AND(T23>\"\",OR(W23=\"\",W24=\"\",W25=\"\",W26=\"\")),AH1,IF(AND(T32>\"\",OR(W32=\"\",W33=\"\",W34=\"\",W35=\"\")),AH1,IF(AND(AC5>\"\",OR(AF5=\"\",AF6=\"\",AF7=\"\",AF8=\"\")),AH1,IF(AND(AC14>\"\",OR(AF14=\"\",AF15=\"\",AF16=\"\",AF17=\"\")),AH1,IF(AND(AC23>\"\",OR(AF23=\"\",AF24=\"\",AF25=\"\",AF26=\"\")),AH1,IF(AND(AC32>\"\",OR(AF32=\"\",AF33=\"\",AF34=\"\",AF35=\"\")),AH1,IF(AND(AK5>\"\",OR(AN5=\"\",AN6=\"\",AN7=\"\",AN8=\"\")),AH1,IF(AND(AK14>\"\",OR(AN14=\"\",AN15=\"\",AN16=\"\",AN17=\"\")),AH1,IF(AND(AK23>\"\",OR(AN23=\"\",AN24=\"\",AN25=\"\",AN26=\"\")),AH1,IF(AND(AK32>\"\",OR(AN32=\"\",AN33=\"\",AN34=\"\",AN35=\"\")),AH1,IF(AND(AS5>\"\",OR(AV5=\"\",AV6=\"\",AV7=\"\",AV8=\"\")),AH1,IF(AND(AS14>\"\",OR(AV14=\"\",AV15=\"\",AV16=\"\",AV17=\"\")),AH1,IF(AND(AS23>\"\",OR(AV23=\"\",AV24=\"\",AV25=\"\",AV26=\"\")),AH1,IF(AND(AS32>\"\",OR(AV32=\"\",AV33=\"\",AV34=\"\",AV35=\"\")),AH1,IF(AND(BA5>\"\",OR(BD5=\"\",BD6=\"\",BD7=\"\",BD8=\"\")),AH1,IF(AND(BA14>\"\",OR(BD14=\"\",BD15=\"\",BD16=\"\",BD17=\"\")),AH1,IF(AND(BA23>\"\",OR(BD23=\"\",BD24=\"\",BD25=\"\",BD26=\"\")),AH1,IF(AND(BA32>\"\",OR(BD32=\"\",BD33=\"\",BD34=\"\",BD35=\"\")),AH1,IF(AND(BI5>\"\",OR(BL5=\"\",BL6=\"\",BL7=\"\",BL8=\"\")),AH1,IF(AND(BI14>\"\",OR(BL14=\"\",BL15=\"\",BL16=\"\",BL17=\"\")),AH1,IF(AND(BI23>\"\",OR(BL23=\"\",BL24=\"\",BL25=\"\",BL26=\"\")),AH1,IF(AND(BI32>\"\",OR(BL32=\"\",BL33=\"\",BL34=\"\",BL35=\"\")),AH1,IF(AND(BQ32>\"\",OR(BT32=\"\",BT33=\"\",BT34=\"\",BT35=\"\")),AH1,IF(AND(P7<>\"\",H7=\"\"),AH2,IF(AND(P8<>\"\",H8=\"\"),AH2,IF(AND(P9<>\"\",H9=\"\"),AH2,IF(AND(P10<>\"\",H10=\"\"),AH2,AK1)))))))))))))))))))))))))))))","v":"Eingabe o.k."}]
[57,null,null,null,null,39,68,null,null,null,null,null,999,39,{"$f":"IF(AO16=\"\",\"\",AO16)","v":""},{"$f":"IF(AN16=\"\",\"\",AN16)","v":""}]
[58,null,null,null,null,40,42,null,null,null,null,null,999,40,{"$f":"IF(AO17=\"\",\"\",AO17)","v":""},{"$f":"IF(AN17=\"\",\"\",AN17)","v":""}]
[60,null,null,null,null,41,24,null,null,null,null,null,999,41,{"$f":"IF(AO23=\"\",\"\",AO23)","v":""},{"$f":"IF(AN23=\"\",\"\",AN23)","v":""}]
[62,null,null,null,null,42,51,null,null,null,null,null,999,42,{"$f":"IF(AO24=\"\",\"\",AO24)","v":""},{"$f":"IF(AN24=\"\",\"\",AN24)","v":""}]
[64,null,null,null,null,43,8,null,null,null,null,null,999,43,{"$f":"IF(AO25=\"\",\"\",AO25)","v":""},{"$f":"IF(AN25=\"\",\"\",AN25)","v":""}]
[65,null,null,null,null,44,57,null,null,null,null,null,999,44,{"$f":"IF(AO26=\"\",\"\",AO26)","v":""},{"$f":"IF(AN26=\"\",\"\",AN26)","v":""}]
[66,null,null,null,null,45,32,null,null,null,null,null,999,45,{"$f":"IF(AO32=\"\",\"\",AO32)","v":""},{"$f":"IF(AN32=\"\",\"\",AN32)","v":""}]
[67,null,null,null,null,46,26,null,null,null,null,null,999,46,{"$f":"IF(AO33=\"\",\"\",AO33)","v":""},{"$f":"IF(AN33=\"\",\"\",AN33)","v":""}]
[69,null,null,null,null,47,1,null,null,null,null,null,999,47,{"$f":"IF(AO34=\"\",\"\",AO34)","v":""},{"$f":"IF(AN34=\"\",\"\",AN34)","v":""}]
[71,null,null,null,null,48,44,null,null,null,null,null,999,48,{"$f":"IF(AO35=\"\",\"\",AO35)","v":""},{"$f":"IF(AN35=\"\",\"\",AN35)","v":""}]
[72,null,null,null,null,49,34,null,null,null,null,null,999,49,{"$f":"IF(AW5=\"\",\"\",AW5)","v":""},{"$f":"IF(AV5=\"\",\"\",AV5)","v":""}]
[73,null,null,null,null,50,41,null,null,null,null,null,999,50,{"$f":"IF(AW6=\"\",\"\",AW6)","v":""},{"$f":"IF(AV6=\"\",\"\",AV6)","v":""}]
[74,null,null,null,null,51,40,null,null,null,null,null,999,51,{"$f":"IF(AW7=\"\",\"\",AW7)","v":""},{"$f":"IF(AV7=\"\",\"\",AV7)","v":""}]
[75,null,null,null,null,52,5,null,null,null,null,null,999,52,{"$f":"IF(AW8=\"\",\"\",AW8)","v":""},{"$f":"IF(AV8=\"\",\"\",AV8)","v":""}]
[76,null,null,null,null,53,30,null,null,null,null,null,999,53,{"$f":"IF(AW14=\"\",\"\",AW14)","v":""},{"$f":"IF(AV14=\"\",\"\",AV14)","v":""}]
[78,null,null,null,null,54,61,null,null,null,null,null,999,54,{"$f":"IF(AW15=\"\",\"\",AW15)","v":""},{"$f":"IF(AV15=\"\",\"\",AV15)","v":""}]
[79,null,null,null,null,55,20,null,null,null,null,null,999,55,{"$f":"IF(AW16=\"\",\"\",AW16)","v":""},{"$f":"IF(AV16=\"\",\"\",AV16)","v":""}]
[80,null,null,null,null,56,48,null,null,null,null,null,999,56,{"$f":"IF(AW17=\"\",\"\",AW17)","v":""},{"$f":"IF(AV17=\"\",\"\",AV17)","v":""}]
[82,null,null,null,null,57,13,null,null,null,null,null,999,57,{"$f":"IF(AW23=\"\",\"\",AW23)","v":""},{"$f":"IF(AV23=\"\",\"\",AV23)","v":""}]
[83,null,null,null,null,58,55,null,null,null,null,null,999,58,{"$f":"IF(AW24=\"\",\"\",AW24)","v":""},{"$f":"IF(AV24=\"\",\"\",AV24)","v":""}]
[86,null,null,null,null,59,23,null,null,null,null,null,999,59,{"$f":"IF(AW25=\"\",\"\",AW25)","v":""},{"$f":"IF(AV25=\"\",\"\",AV25)","v":""}]
[87,null,null,null,null,60,18,null,null,null,null,null,999,60,{"$f":"IF(AW26=\"\",\"\",AW26)","v":""},{"$f":"IF(AV26=\"\",\"\",AV26)","v":""}]
[90,null,null,null,null,61,17,null,null,null,null,null,999,61,{"$f":"IF(AW32=\"\",\"\",AW32)","v":""},{"$f":"IF(AV32=\"\",\"\",AV32)","v":""}]
[91,null,null,null,null,62,10,null,null,null,null,null,999,62,{"$f":"IF(AW33=\"\",\"\",AW33)","v":""},{"$f":"IF(AV33=\"\",\"\",AV33)","v":""}]
[92,null,null,null,null,63,45,null,null,null,null,null,999,63,{"$f":"IF(AW34=\"\",\"\",AW34)","v":""},{"$f":"IF(AV34=\"\",\"\",AV34)","v":""}]
[94,null,null,null,null,64,11,null,null,null,null,null,999,64,{"$f":"IF(AW35=\"\",\"\",AW35)","v":""},{"$f":"IF(AV35=\"\",\"\",AV35)","v":""}]
[95,null,null,null,null,65,66,null,null,null,null,null,{"$f":"IF(H67>\"\",A67,999)","v":999},65,{"$f":"IF(BE5=\"\",\"\",BE5)","v":""},{"$f":"IF(BD5=\"\",\"\",BD5)","v":""}]
[98,null,null,null,null,66,35,null,null,null,null,null,999,66,{"$f":"IF(BE6=\"\",\"\",BE6)","v":""},{"$f":"IF(BD6=\"\",\"\",BD6)","v":""}]
[99,null,null,null,null,67,7,null,null,null,null,null,999,67,{"$f":"IF(BE7=\"\",\"\",BE7)","v":""},{"$f":"IF(BD7=\"\",\"\",BD7)","v":""}]
[100,null,null,null,null,68,60,null,null,null,null,null,999,68,{"$f":"IF(BE8=\"\",\"\",BE8)","v":""},{"$f":"IF(BD8=\"\",\"\",BD8)","v":""}]
[81,null,null,null,null,69,69,null,null,null,null,null,999,69,{"$f":"IF(BE14=\"\",\"\",BE14)","v":""},{"$f":"IF(BD14=\"\",\"\",BD14)","v":""}]
[39,null,null,null,null,70,70,null,null,null,null,null,999,70,{"$f":"IF(BE15=\"\",\"\",BE15)","v":""},{"$f":"IF(BD15=\"\",\"\",BD15)","v":""}]
[61,null,null,null,null,71,71,null,null,null,null,null,999,71,{"$f":"IF(BE16=\"\",\"\",BE16)","v":""},{"$f":"IF(BD16=\"\",\"\",BD16)","v":""}]
[59,null,null,null,null,72,72,null,null,null,null,null,999,72,{"$f":"IF(BE17=\"\",\"\",BE17)","v":""},{"$f":"IF(BD17=\"\",\"\",BD17)","v":""}]
[77,null,null,null,null,73,73,null,null,null,null,null,999,73,{"$f":"IF(BE23=\"\",\"\",BE23)","v":""},{"$f":"IF(BD23=\"\",\"\",BD23)","v":""}]
[93,null,null,null,null,74,74,null,null,null,null,null,999,74,{"$f":"IF(BE24=\"\",\"\",BE24)","v":""},{"$f":"IF(BD24=\"\",\"\",BD24)","v":""}]
[20,null,null,null,null,75,75,null,null,null,null,null,999,75,{"$f":"IF(BE25=\"\",\"\",BE25)","v":""},{"$f":"IF(BD25=\"\",\"\",BD25)","v":""}]
[11,null,null,null,null,76,76,null,null,null,null,null,999,76,{"$f":"IF(BE26=\"\",\"\",BE26)","v":""},{"$f":"IF(BD26=\"\",\"\",BD26)","v":""}]
[17,null,null,null,null,77,77,null,null,null,null,null,999,77,{"$f":"IF(BE32=\"\",\"\",BE32)","v":""},{"$f":"IF(BD32=\"\",\"\",BD32)","v":""}]
[85,null,null,null,null,78,78,null,null,null,null,null,999,78,{"$f":"IF(BE33=\"\",\"\",BE33)","v":""},{"$f":"IF(BD33=\"\",\"\",BD33)","v":""}]
[32,null,null,null,null,79,79,null,null,null,null,null,999,79,{"$f":"IF(BE34=\"\",\"\",BE34)","v":""},{"$f":"IF(BD34=\"\",\"\",BD34)","v":""}]
[68,null,null,null,null,80,80,null,null,null,null,null,999,80,{"$f":"IF(BE35=\"\",\"\",BE35)","v":""},{"$f":"IF(BD35=\"\",\"\",BD35)","v":""}]
[88,null,null,null,null,81,81,null,null,null,null,null,999,81,{"$f":"IF(BM5=\"\",\"\",BM5)","v":""},{"$f":"IF(BL5=\"\",\"\",BL5)","v":""}]
[7,null,null,null,null,82,82,null,null,null,null,null,999,82,{"$f":"IF(BM6=\"\",\"\",BM6)","v":""},{"$f":"IF(BL6=\"\",\"\",BL6)","v":""}]
[70,null,null,null,null,83,83,null,null,null,null,null,999,83,{"$f":"IF(BM7=\"\",\"\",BM7)","v":""},{"$f":"IF(BL7=\"\",\"\",BL7)","v":""}]
[21,null,null,null,null,84,84,null,null,null,null,null,999,84,{"$f":"IF(BM8=\"\",\"\",BM8)","v":""},{"$f":"IF(BL8=\"\",\"\",BL8)","v":""}]
[31,null,null,null,null,85,85,null,null,null,null,null,999,85,{"$f":"IF(BM14=\"\",\"\",BM14)","v":""},{"$f":"IF(BL14=\"\",\"\",BL14)","v":""}]
[97,null,null,null,null,86,86,null,null,null,null,null,999,86,{"$f":"IF(BM15=\"\",\"\",BM15)","v":""},{"$f":"IF(BL15=\"\",\"\",BL15)","v":""}]
[56,null,null,null,null,87,87,null,null,null,null,null,999,87,{"$f":"IF(BM16=\"\",\"\",BM16)","v":""},{"$f":"IF(BL16=\"\",\"\",BL16)","v":""}]
[47,null,null,null,null,88,88,null,null,null,null,null,999,88,{"$f":"IF(BM17=\"\",\"\",BM17)","v":""},{"$f":"IF(BL17=\"\",\"\",BL17)","v":""}]
[84,null,null,null,null,89,89,null,null,null,null,null,999,89,{"$f":"IF(BM23=\"\",\"\",BM23)","v":""},{"$f":"IF(BL23=\"\",\"\",BL23)","v":""}]
[26,null,null,null,null,90,90,null,null,null,null,null,999,90,{"$f":"IF(BM24=\"\",\"\",BM24)","v":""},{"$f":"IF(BL24=\"\",\"\",BL24)","v":""}]
[37,null,null,null,null,91,91,null,null,null,null,null,999,91,{"$f":"IF(BM25=\"\",\"\",BM25)","v":""},{"$f":"IF(BL25=\"\",\"\",BL25)","v":""}]
[43,null,null,null,null,92,92,null,null,null,null,null,999,92,{"$f":"IF(BM26=\"\",\"\",BM26)","v":""},{"$f":"IF(BL26=\"\",\"\",BL26)","v":""}]
[6,null,null,null,null,93,93,null,null,null,null,null,999,93,{"$f":"IF(BM32=\"\",\"\",BM32)","v":""},{"$f":"IF(BL32=\"\",\"\",BL32)","v":""}]
[41,null,null,null,null,94,94,null,null,null,null,null,999,94,{"$f":"IF(BM33=\"\",\"\",BM33)","v":""},{"$f":"IF(BL33=\"\",\"\",BL33)","v":""}]
[63,null,null,null,null,95,95,null,null,null,null,null,999,95,{"$f":"IF(BM34=\"\",\"\",BM34)","v":""},{"$f":"IF(BL34=\"\",\"\",BL34)","v":""}]
[12,null,null,null,null,96,96,null,null,null,null,null,999,96,{"$f":"IF(BM35=\"\",\"\",BM35)","v":""},{"$f":"IF(BL35=\"\",\"\",BL35)","v":""}]
[46,null,null,null,null,97,97,null,null,null,null,null,999,97,{"$f":"IF(BU5=\"\",\"\",BU5)","v":""},{"$f":"IF(BT5=\"\",\"\",BT5)","v":""}]
[96,null,null,null,null,98,98,null,null,null,null,null,999,98,{"$f":"IF(BU6=\"\",\"\",BU6)","v":""},{"$f":"IF(BT6=\"\",\"\",BT6)","v":""}]
[89,null,null,null,null,99,99,null,null,null,null,null,999,99,{"$f":"IF(BU7=\"\",\"\",BU7)","v":""},{"$f":"IF(BT7=\"\",\"\",BT7)","v":""}]
[44,null,null,null,null,100,100,null,null,null,null,null,999,100,{"$f":"IF(BU8=\"\",\"\",BU8)","v":""},{"$f":"IF(BT8=\"\",\"\",BT8)","v":""}]

{"sheet":"Teilnehmer 2.Runde","index":4,"n_rows":132,"n_cols":7,"rows_kept":132,"cut":false,"hidden":true,"merged":[]}
[]
[]
[]
[]
[]
[null,null,null,"Nr.:","Vorname","Name","Alter"]
[{"$f":"IF(E7=\"\",\"x\",\"\")","v":""},{"$f":"RAND()","v":0.44045349918910115},null,null,"Test54","54",153]
[{"$f":"IF(E8=\"\",\"x\",\"\")","v":""},{"$f":"RAND()","v":0.53003649988272905},null,null,"Test34","34",133]
["",0.64770672408791796,null,null,"Test67","67",166]
["",0.33853333398626972,null,null,"Test35","35",134]
["",0.56052087570984654,null,null,"Test49","49",148]
["",0.64105725532326918,{"$f":"RANK(B12,#REF!)","v":{"$error":"#REF!"}},null,"Test47","47",146]
["",0.13874327266806397,null,null,"Test43","43",142]
["",0.28001213047445062,null,null,"Test38","38",137]
["",0.52410224698175567,null,null,"Test9","9",108]
["",0.55439746645304155,null,null,"Test19","19",118]
["",0.45097031160515988,null,null,"Test37","37",136]
["",0.5017808623524076,null,null,"Test58","58",157]
["",0.43716453202720751,null,null,"Test60","60",159]
["",0.32350479191841242,{"$f":"RANK(B20,#REF!)","v":{"$error":"#REF!"}},null,"Test68","68",167]
["",0.32297532257487727,{"$f":"RANK(B21,#REF!)","v":{"$error":"#REF!"}},null,"Test16","16",115]
["",0.78782321730448313,null,null,"Test39","39",138]
["",0.74110408425530605,null,null,"Test27","27",126]
["",0.20224267879105051,null,null,"Test22","22",121]
["",0.41763221898067637,null,null,"Test17","17",116]
["",0.55748903685528384,null,null,"Test53","53",152]
["",0.40734320629641063,null,null,"Test20","20",119]
["",0.56015244786894269,null,null,"Test14","14",113]
["",0.49906733544991932,null,null,"Test1","1",100]
["",0.34784944309734267,null,null,"Test28","28",127]
["",0.38474273585259156,null,null,"Test30","30",129]
["",0.86123224926508324,null,null,"Test24","24",123]
["",0.12826547824676271,null,null,"Test62","62",161]
["",0.65912815430470051,null,null,"Test45","45",144]
["",0.58875796627513755,null,null,"Test31","31",130]
["",0.56173844493049863,{"$f":"RANK(B36,#REF!)","v":{"$error":"#REF!"}},null,"Test48","48",147]
["",0.99983711257405961,null,null,"Test7","7",106]
["",1.0642563746763423E-2,null,null,"Test36","36",135]
["",0.13799233810847722,null,null,"Test5","5",104]
["",0.4882469135551889,null,null,"Test57","57",156]
["",5.3316374059748428E-2,{"$f":"RANK(B41,#REF!)","v":{"$error":"#REF!"}},null,"Test3","3",102]
["",0.27365796741142911,null,null,"Test15","15",114]
["x",0.95574161384755596]
["x",0.13213137046312029]
["x",0.50983603789261622]
["x",0.7946766774966052]
["x",0.57787597063656126]
["x",0.7105438771960132]
["x",0.35313609528818724]
["x",0.49921126333325783]
["x",0.52499894561104954]
["x",1.0946230975708793E-2]
["x",0.43910021443398306]
["x",0.77724862369900749]
["x",0.2790096115498929]
["x",0.810687616325794]
["x",0.74809563918793998]
["x",6.5500167433293122E-2]
["x",5.8594711657876442E-2]
["x",0.91681500966231877]
["x",0.5744946852679983]
["x",0.13763622571630019]
["x",0.75482649250643041]
["x",0.86715801555818617]
["x",0.11133116623185291]
["x",0.32974862148346828]
["x",0.73867101214919595]
["x",0.51630204239593924]
["x",0.13889327951653696]
["x",0.82906128620312858]
["x",3.2670470638302973E-2]
[{"$f":"IF(E72=\"\",\"x\",\"\")","v":"x"},{"$f":"RAND()","v":0.13859138232601687}]
["x",0.60726306832786581]
["x",0.30296341787983505]
["x",0.53084938521737912]
["x",7.2065271053184277E-2]
["x",0.24183662536241268]
["x",0.67697913964391843]
["x",0.58394793779689758]
["x",0.71324504432224201]
["x",0.54902312881806214]
["x",0.2729130440213714]
["x",0.44472128313603398]
["x",0.84258504052690797]
["x",0.33728114392816899]
["x",0.83974503904709175]
["x",0.69301055320102634]
["x",0.79878589168000791]
["x",0.18166412786563124]
["x",0.53621289775825198]
["x",0.62880441887460381]
["x",0.26002943927078048]
["x",0.6588066626885285]
["x",0.81904733983930755]
["x",0.40216855791522221]
["x",0.93402833254140982]
["x",0.63029418161916329]
["x",0.81324715649275237]
["x",0.89387038767473759]
["x",0.60864557125463736]
["x",0.4518517198714076]
["x",0.8697260862556293]
["x",0.25067301589502688]
["x",0.69360094739053746]
["x",0.88401486018573494]
["x",0.32181757466555161]
["x",0.95948435454709102]
["x",9.8043101871864713E-2]
["x",0.88667431310875022]
["x",2.5784165805463166E-2]
["x",7.8596619298991088E-2]
["x",0.31931675251514902]
["x",0.11592066363713305]
["x",0.15700625556044001]
["x",0.91333099434157194]
["x",0.81481861910671594]
["x",0.64375027238383886]
["x",0.29021656515118188]
["x",0.6197045498702396]
["x",0.55735348510480398]
["x",0.71308079260862567]
["x",0.19728978543242504]
["x",0.99664538516593648]
["x",0.41712410278917478]
["x",0.75315220462675603]
["x",0.77624621725904552]
["x",0.82429002507287696]
["x",0.96432955566491096]
[{"$f":"IF(F129>\"\",B129,IF(G129>\"\",B129,\"\"))","v":""},0.29289432475235444]
["x",0.88110552775432838]
["x",0.99918263917501959]
["x",0.40751559547014027]

{"sheet":"Runde 2","index":5,"n_rows":60,"n_cols":45,"rows_kept":60,"cut":false,"hidden":false,"merged":[[39,31,41,43],[1,31,2,35],[10,31,11,35],[19,31,20,35],[28,31,29,35],[1,39,2,43],[10,39,11,43],[18,39,19,42],[18,43,19,43],[39,15,41,27],[1,15,2,19],[10,15,11,19],[19,15,20,19],[28,15,29,19],[1,23,2,27],[10,23,11,27],[19,23,20,27],[28,23,29,27]]}
[null,null,null,null,null,null,null,null,null,null,null,null,null,null,null,"3.Runde starten >",null,null,null,null,null,null,null,null,null,null,null,null,null,null,null,{"$f":"IF(P40=\"Eingabe o.k.\",1,\"\")","v":1},"Es wurden Punkte eingetragen für die kein Spieler zugeordnet ist !!!","Es wurden nicht für jeden Spieler Punkte in dieser Runde eingetragen !!!",null,null,{"$f":"IF(AND(L10<>\"\",H10=\"\"),AG1,IF(AND(L11<>\"\",H11=\"\"),AG1,IF(AND(L12<>\"\",H12=\"\"),AG1,IF(AND(L13<>\"\",H13=\"\"),AG1,IF(AND(L14<>\"\",H14=\"\"),AG1,IF(AND(L15<>\"\",H15=\"\"),AG1,IF(AND(L16<>\"\",H16=\"\"),AG1,IF(AND(L17<>\"\",H17=\"\"),AG1,IF(AND(L18<>\"\",H18=\"\"),AG1,IF(AND(L19<>\"\",H19=\"\"),AG1,IF(AND(L20<>\"\",H20=\"\"),AG1,IF(AND(L21<>\"\",H21=\"\"),AG1,IF(AND(L22<>\"\",H22=\"\"),AG1,IF(AND(L23<>\"\",H23=\"\"),AG1,IF(AND(L24<>\"\",H24=\"\"),AG1,IF(AND(L25<>\"\",H25=\"\"),AG1,IF(AND(L26<>\"\",H26=\"\"),AG1,IF(AND(L27<>\"\",H27=\"\"),AG1,IF(AND(L28<>\"\",H28=\"\"),AG1,IF(AND(L29<>\"\",H29=\"\"),AG1,IF(AND(L30<>\"\",H30=\"\"),AG1,IF(AND(L31<>\"\",H31=\"\"),AG1,IF(AND(L32<>\"\",H32=\"\"),AG1,IF(AND(L33<>\"\",H33=\"\"),AG1,IF(AND(L34<>\"\",H34=\"\"),AG1,IF(AND(L35<>\"\",L35=\"\"),AG1,IF(AND(L36<>\"\",H36=\"\"),AG1,IF(AND(L37<>\"\",H37=\"\"),AG1,IF(AND(L38<>\"\",H38=\"\"),AG1,AL1)))))))))))))))))))))))))))))","v":"Eingabe o.k."},{"$f":"IF(AND(L39<>\"\",H39=\"\"),AG1,IF(AND(L40<>\"\",H40=\"\"),AG1,IF(AND(L41<>\"\",H41=\"\"),AG1,IF(AND(L42<>\"\",H42=\"\"),AG1,IF(AND(L43<>\"\",H43=\"\"),AG1,IF(AND(L44<>\"\",H44=\"\"),AG1,IF(AND(L45<>\"\",H45=\"\"),AG1,IF(AND(L46<>\"\",H46=\"\"),AG1,IF(AND(L47<>\"\",H47=\"\"),AG1,IF(AND(L48<>\"\",H48=\"\"),AG1,IF(AND(L49<>\"\",H49=\"\"),AG1,IF(AND(L50<>\"\",H50=\"\"),AG1,IF(AND(L51<>\"\",H51=\"\"),AG1,IF(AND(L52<>\"\",H52=\"\"),AG1,IF(AND(L53<>\"\",H53=\"\"),AG1,IF(AND(L54<>\"\",H54=\"\"),AG1,IF(AND(L55<>\"\",H55=\"\"),AG1,IF(AND(L56<>\"\",H56=\"\"),AG1,IF(AND(L57<>\"\",H57=\"\"),AG1,IF(AND(L58<>\"\",H58=\"\"),AG1,\"Eingabe o.k.\"))))))))))))))))))))","v":"Eingabe o.k."}]
[null,null,null,null,null,null,null,"Vorname","Name","Alter","Platzierung","Punkte",null,null,null,{"$f":"IF(ISTEXT('Teilnehmer Erfassung'!N2),\"Tisch 1 Rund 2\",IF('Teilnehmer Erfassung'!N2=4,\"Finale\",IF('Teilnehmer Erfassung'!N2=8,\"Halbfinale 1\",\"Tisch 1 Runde 2\")))","v":"Tisch 1 Rund 2"},null,null,null,null,null,null,null,"Tisch 5 Runde 2",null,null,null,null,null,null,null,"Tisch 9 Runde 2",null,null,null,null,null,null,null,"Tisch 13 Runde 2"]
[1,{"$f":"IF(A3>0,A3,999)","v":1},null,null,null,{"$f":"IF(G3>0,G3,999)","v":999},null,null,null,null,{"$f":"IF(T5=\"\",\"\",T5)","v":""},{"$f":"IF(S5=\"\",\"\",S5)","v":""}]
[2,2,null,null,null,999,null,null,null,null,{"$f":"IF(T6=\"\",\"\",T6)","v":""},{"$f":"IF(S6=\"\",\"\",S6)","v":""},null,null,null,"Vorname","Name","Alter","Punkte","Platzierung",null,null,null,"Vorname","Name","Alter","Punkte","Platzierung",null,null,null,"Vorname","Name","Alter","Punkte","Platzierung",null,null,null,"Vorname","Name","Alter","Punkte","Platzierung"]
[3,3,null,null,null,999,null,null,null,null,"","",null,1,null,{"$f":"IF(H3=\"\",\"\",VLOOKUP(N5,$A$3:$J$54,8,0))","v":""},{"$f":"IF(I3=\"\",\"\",VLOOKUP(N5,$A$3:$J$54,9,0))","v":""},{"$f":"IF(J3=\"\",\"\",VLOOKUP(N5,$A$3:$J$54,10,0))","v":""},null,{"$f":"IFERROR(IF(S5=\"\",\"\",RANK(S5,$S$5:$S$8)),0)","v":""},{"$f":"IF(T5=\"\",0,1)","v":0},null,17,{"$f":"IF(H19=\"\",\"\",VLOOKUP(W5,$A$3:$J$58,8,0))","v":""},{"$f":"IF(I19=\"\",\"\",VLOOKUP(W5,$A$3:$J$58,9,0))","v":""},{"$f":"IF(J19=\"\",\"\",VLOOKUP(W5,$A$3:$J$58,10,0))","v":""},null,{"$f":"IFERROR(IF(AA5=\"\",\"\",RANK(AA5,$AA$5:$AA$8)),0)","v":""},{"$f":"IF(X5=\"\",0,1)","v":0},null,33,{"$f":"IF(H35=\"\",\"\",(VLOOKUP(AE5,$A$3:$J$58,8,0)))","v":""},{"$f":"IF(I35=\"\",\"\",VLOOKUP(AE5,$A$3:$J$58,9,0))","v":""},{"$f":"IF(J35=\"\",\"\",VLOOKUP(AE5,$A$3:$J$58,10,0))","v":""},null,{"$f":"IFERROR(IF(AI5=\"\",\"\",RANK(AI5,$AI$5:$AI$8)),0)","v":""},{"$f":"IF(AF5=\"\",0,1)","v":0},null,49,{"$f":"IF(H51=\"\",\"\",(VLOOKUP(AM5,$A$3:$J$58,8,0)))","v":""},{"$f":"IF(I51=\"\",\"\",VLOOKUP(AM5,$A$3:$J$58,9,0))","v":""},{"$f":"IF(J51=\"\",\"\",VLOOKUP(AM5,$A$3:$J$58,10,0))","v":""},null,{"$f":"IFERROR(IF(AQ5=\"\",\"\",RANK(AQ5,$AQ$5:$AQ$8)),0)","v":""},{"$f":"IF(AN5=\"\",0,1)","v":0}]
[4,4,null,null,null,999,null,null,null,null,"","",null,2,null,{"$f":"IF(H4=\"\",\"\",VLOOKUP(N6,$A$3:$J$54,8,0))","v":""},{"$f":"IF(I4=\"\",\"\",VLOOKUP(N6,$A$3:$J$54,9,0))","v":""},{"$f":"IF(J4=\"\",\"\",VLOOKUP(N6,$A$3:$J$54,10,0))","v":""},null,{"$f":"IFERROR(IF(S6=\"\",\"\",RANK(S6,$S$5:$S$8)),0)","v":""},null,null,18,{"$f":"IF(H20=\"\",\"\",VLOOKUP(W6,$A$3:$J$58,8,0))","v":""},{"$f":"IF(I20=\"\",\"\",VLOOKUP(W6,$A$3:$J$58,9,0))","v":""},{"$f":"IF(J20=\"\",\"\",VLOOKUP(W6,$A$3:$J$58,10,0))","v":""},null,{"$f":"IFERROR(IF(AA6=\"\",\"\",RANK(AA6,$AA$5:$AA$8)),0)","v":""},null,null,34,{"$f":"IF(H36=\"\",\"\",(VLOOKUP(AE6,$A$3:$J$58,8,0)))","v":""},{"$f":"IF(I36=\"\",\"\",VLOOKUP(AE6,$A$3:$J$58,9,0))","v":""},{"$f":"IF(J36=\"\",\"\",VLOOKUP(AE6,$A$3:$J$58,10,0))","v":""},null,{"$f":"IFERROR(IF(AI6=\"\",\"\",RANK(AI6,$AI$5:$AI$8)),0)","v":""},null,null,50,{"$f":"IF(H52=\"\",\"\",(VLOOKUP(AM6,$A$3:$J$58,8,0)))","v":""},{"$f":"IF(I52=\"\",\"\",VLOOKUP(AM6,$A$3:$J$58,9,0))","v":""},{"$f":"IF(J52=\"\",\"\",VLOOKUP(AM6,$A$3:$J$58,10,0))","v":""},null,{"$f":"IFERROR(IF(AQ6=\"\",\"\",RANK(AQ6,$AQ$5:$AQ$8)),0)","v":""}]
[5,5,null,null,null,999,null,null,null,null,{"$f":"IF(T14=\"\",\"\",T14)","v":""},{"$f":"IF(S14=\"\",\"\",S14)","v":""},null,3,null,{"$f":"IF(H5=\"\",\"\",VLOOKUP(N7,$A$3:$J$54,8,0))","v":""},{"$f":"IF(I5=\"\",\"\",VLOOKUP(N7,$A$3:$J$54,9,0))","v":""},{"$f":"IF(J5=\"\",\"\",VLOOKUP(N7,$A$3:$J$54,10,0))","v":""},null,{"$f":"IFERROR(IF(S7=\"\",\"\",RANK(S7,$S$5:$S$8)),0)","v":""},null,null,19,{"$f":"IF(H21=\"\",\"\",VLOOKUP(W7,$A$3:$J$58,8,0))","v":""},{"$f":"IF(I21=\"\",\"\",VLOOKUP(W7,$A$3:$J$58,9,0))","v":""},{"$f":"IF(J21=\"\",\"\",VLOOKUP(W7,$A$3:$J$58,10,0))","v":""},null,{"$f":"IFERROR(IF(AA7=\"\",\"\",RANK(AA7,$AA$5:$AA$8)),0)","v":""},null,null,35,{"$f":"IF(H37=\"\",\"\",(VLOOKUP(AE7,$A$3:$J$58,8,0)))","v":""},{"$f":"IF(I37=\"\",\"\",VLOOKUP(AE7,$A$3:$J$58,9,0))","v":""},{"$f":"IF(J37=\"\",\"\",VLOOKUP(AE7,$A$3:$J$58,10,0))","v":""},null,{"$f":"IFERROR(IF(AI7=\"\",\"\",RANK(AI7,$AI$5:$AI$8)),0)","v":""},null,null,51,{"$f":"IF(H53=\"\",\"\",(VLOOKUP(AM7,$A$3:$J$58,8,0)))","v":""},{"$f":"IF(I53=\"\",\"\",VLOOKUP(AM7,$A$3:$J$58,9,0))","v":""},{"$f":"IF(J53=\"\",\"\",VLOOKUP(AM7,$A$3:$J$58,10,0))","v":""},null,{"$f":"IFERROR(IF(AQ7=\"\",\"\",RANK(AQ7,$AQ$5:$AQ$8)),0)","v":""}]
[6,6,null,null,null,999,null,null,null,null,{"$f":"IF(T15=\"\",\"\",T15)","v":""},{"$f":"IF(S15=\"\",\"\",S15)","v":""},null,4,null,{"$f":"IF(H6=\"\",\"\",VLOOKUP(N8,$A$3:$J$54,8,0))","v":""},{"$f":"IF(I6=\"\",\"\",VLOOKUP(N8,$A$3:$J$54,9,0))","v":""},{"$f":"IF(J6=\"\",\"\",VLOOKUP(N8,$A$3:$J$54,10,0))","v":""},null,{"$f":"IFERROR(IF(S8=\"\",\"\",RANK(S8,$S$5:$S$8)),0)","v":""},null,null,20,{"$f":"IF(H22=\"\",\"\",VLOOKUP(W8,$A$3:$J$58,8,0))","v":""},{"$f":"IF(I22=\"\",\"\",VLOOKUP(W8,$A$3:$J$58,9,0))","v":""},{"$f":"IF(J22=\"\",\"\",VLOOKUP(W8,$A$3:$J$58,10,0))","v":""},null,{"$f":"IFERROR(IF(AA8=\"\",\"\",RANK(AA8,$AA$5:$AA$8)),0)","v":""},null,null,36,{"$f":"IF(H38=\"\",\"\",(VLOOKUP(AE8,$A$3:$J$58,8,0)))","v":""},{"$f":"IF(I38=\"\",\"\",VLOOKUP(AE8,$A$3:$J$58,9,0))","v":""},{"$f":"IF(J38=\"\",\"\",VLOOKUP(AE8,$A$3:$J$58,10,0))","v":""},null,{"$f":"IFERROR(IF(AI8=\"\",\"\",RANK(AI8,$AI$5:$AI$8)),0)","v":""},null,null,52,{"$f":"IF(H54=\"\",\"\",(VLOOKUP(AM8,$A$3:$J$58,8,0)))","v":""},{"$f":"IF(I54=\"\",\"\",VLOOKUP(AM8,$A$3:$J$58,9,0))","v":""},{"$f":"IF(J54=\"\",\"\",VLOOKUP(AM8,$A$3:$J$58,10,0))","v":""},null,{"$f":"IFERROR(IF(AQ8=\"\",\"\",RANK(AQ8,$AQ$5:$AQ$8)),0)","v":""}]
[7,7,null,null,null,999,null,null,null,null,"",""]
[8,8,null,null,null,999,null,null,null,null,"",""]
[9,9,null,null,null,999,null,null,null,null,{"$f":"IF(T23=\"\",\"\",T23)","v":""},{"$f":"IF(S23=\"\",\"\",S23)","v":""},null,null,null,{"$f":"IF(ISTEXT('Teilnehmer Erfassung'!N2),\"Tisch 2 Rund 2\",IF('Teilnehmer Erfassung'!N2=8,\"Halbfinale 2\",\"Tisch 2 Runde 2\"))","v":"Tisch 2 Rund 2"},null,null,null,null,null,null,null,"Tisch 6 Runde 2",null,null,null,null,null,null,null,"Tisch 10 Runde 2",null,null,null,null,null,null,null,"Tisch 14 Runde 2"]
[10,10,null,null,null,999,null,null,null,null,{"$f":"IF(T24=\"\",\"\",T24)","v":""},{"$f":"IF(S24=\"\",\"\",S24)","v":""}]
[11,11,null,null,null,999,null,null,null,null,"","",null,null,null,"Vorname","Name","Alter","Punkte","Platzierung",null,null,null,"Vorname","Name","Alter","Punkte","Platzierung",null,null,null,"Vorname","Name","Alter","Punkte","Platzierung",null,null,null,"Vorname","Name","Alter","Punkte","Platzierung"]
[12,12,null,null,null,999,null,null,null,null,"","",null,5,null,{"$f":"IF(H7=\"\",\"\",VLOOKUP(N14,$A$3:$J$58,8,0))","v":""},{"$f":"IF(I7=\"\",\"\",VLOOKUP(N14,$A$3:$J$58,9,0))","v":""},{"$f":"IF(J7=\"\",\"\",VLOOKUP(N14,$A$3:$J$58,10,0))","v":""},null,{"$f":"IFERROR(IF(S14=\"\",\"\",RANK(S14,$S$14:$S$17)),0)","v":""},null,null,21,{"$f":"IF(H23=\"\",\"\",(VLOOKUP(W14,$A$3:$J$58,8,0)))","v":""},{"$f":"IF(I23=\"\",\"\",VLOOKUP(W14,$A$3:$J$58,9,0))","v":""},{"$f":"IF(J22=\"\",\"\",VLOOKUP(W14,$A$3:$J$58,10,0))","v":""},null,{"$f":"IFERROR(IF(AA14=\"\",\"\",RANK(AA14,$AA$14:$AA$17)),0)","v":""},null,null,37,{"$f":"IF(H39=\"\",\"\",(VLOOKUP(AE14,$A$3:$J$58,8,0)))","v":""},{"$f":"IF(I39=\"\",\"\",VLOOKUP(AE14,$A$3:$J$58,9,0))","v":""},{"$f":"IF(J39=\"\",\"\",VLOOKUP(AE14,$A$3:$J$58,10,0))","v":""},null,{"$f":"IFERROR(IF(AI14=\"\",\"\",RANK(AI14,$AI$14:$AI$17)),0)","v":""},null,null,53,{"$f":"IF(H55=\"\",\"\",(VLOOKUP(AM14,$A$3:$J$58,8,0)))","v":""},{"$f":"IF(I55=\"\",\"\",VLOOKUP(AM14,$A$3:$J$58,9,0))","v":""},{"$f":"IF(J55=\"\",\"\",VLOOKUP(AM14,$A$3:$J$58,10,0))","v":""},null,{"$f":"IFERROR(IF(AQ14=\"\",\"\",RANK(AQ14,$AQ$14:$AQ$17)),0)","v":""}]
[13,13,null,null,null,999,null,null,null,null,{"$f":"IF(T32=\"\",\"\",T32)","v":""},{"$f":"IF(S32=\"\",\"\",S32)","v":""},null,6,null,{"$f":"IF(H8=\"\",\"\",VLOOKUP(N15,$A$3:$J$58,8,0))","v":""},{"$f":"IF(I8=\"\",\"\",VLOOKUP(N15,$A$3:$J$58,9,0))","v":""},{"$f":"IF(J8=\"\",\"\",VLOOKUP(N15,$A$3:$J$58,10,0))","v":""},null,{"$f":"IFERROR(IF(S15=\"\",\"\",RANK(S15,$S$14:$S$17)),0)","v":""},null,null,22,{"$f":"IF(H24=\"\",\"\",(VLOOKUP(W15,$A$3:$J$58,8,0)))","v":""},{"$f":"IF(I24=\"\",\"\",VLOOKUP(W15,$A$3:$J$58,9,0))","v":""},{"$f":"IF(J23=\"\",\"\",VLOOKUP(W15,$A$3:$J$58,10,0))","v":""},null,{"$f":"IFERROR(IF(AA15=\"\",\"\",RANK(AA15,$AA$14:$AA$17)),0)","v":""},null,null,38,{"$f":"IF(H40=\"\",\"\",(VLOOKUP(AE15,$A$3:$J$58,8,0)))","v":""},{"$f":"IF(I40=\"\",\"\",VLOOKUP(AE15,$A$3:$J$58,9,0))","v":""},{"$f":"IF(J40=\"\",\"\",VLOOKUP(AE15,$A$3:$J$58,10,0))","v":""},null,{"$f":"IFERROR(IF(AI15=\"\",\"\",RANK(AI15,$AI$14:$AI$17)),0)","v":""},null,null,54,{"$f":"IF(H56=\"\",\"\",(VLOOKUP(AM15,$A$3:$J$58,8,0)))","v":""},{"$f":"IF(I56=\"\",\"\",VLOOKUP(AM15,$A$3:$J$58,9,0))","v":""},{"$f":"IF(J56=\"\",\"\",VLOOKUP(AM15,$A$3:$J$58,10,0))","v":""},null,{"$f":"IFERROR(IF(AQ15=\"\",\"\",RANK(AQ15,$AQ$14:$AQ$17)),0)","v":""}]
[14,14,null,null,null,999,null,null,null,null,{"$f":"IF(T33=\"\",\"\",T33)","v":""},{"$f":"IF(S33=\"\",\"\",S33)","v":""},null,7,null,{"$f":"IF(H9=\"\",\"\",VLOOKUP(N16,$A$3:$J$58,8,0))","v":""},{"$f":"IF(I9=\"\",\"\",VLOOKUP(N16,$A$3:$J$58,9,0))","v":""},{"$f":"IF(J9=\"\",\"\",VLOOKUP(N16,$A$3:$J$58,10,0))","v":""},null,{"$f":"IFERROR(IF(S16=\"\",\"\",RANK(S16,$S$14:$S$17)),0)","v":""},null,null,23,{"$f":"IF(H25=\"\",\"\",(VLOOKUP(W16,$A$3:$J$58,8,0)))","v":""},{"$f":"IF(I25=\"\",\"\",VLOOKUP(W16,$A$3:$J$58,9,0))","v":""},{"$f":"IF(J24=\"\",\"\",VLOOKUP(W16,$A$3:$J$58,10,0))","v":""},null,{"$f":"IFERROR(IF(AA16=\"\",\"\",RANK(AA16,$AA$14:$AA$17)),0)","v":""},null,null,39,{"$f":"IF(H41=\"\",\"\",(VLOOKUP(AE16,$A$3:$J$58,8,0)))","v":""},{"$f":"IF(I41=\"\",\"\",VLOOKUP(AE16,$A$3:$J$58,9,0))","v":""},{"$f":"IF(J41=\"\",\"\",VLOOKUP(AE16,$A$3:$J$58,10,0))","v":""},null,{"$f":"IFERROR(IF(AI16=\"\",\"\",RANK(AI16,$AI$14:$AI$17)),0)","v":""},null,null,55,{"$f":"IF(H57=\"\",\"\",(VLOOKUP(AM16,$A$3:$J$58,8,0)))","v":""},{"$f":"IF(I57=\"\",\"\",VLOOKUP(AM16,$A$3:$J$58,9,0))","v":""},{"$f":"IF(J57=\"\",\"\",VLOOKUP(AM16,$A$3:$J$58,10,0))","v":""},null,{"$f":"IFERROR(IF(AQ16=\"\",\"\",RANK(AQ16,$AQ$14:$AQ$17)),0)","v":""}]
[15,15,null,null,null,999,null,null,null,null,"","",null,8,null,{"$f":"IF(H10=\"\",\"\",VLOOKUP(N17,$A$3:$J$58,8,0))","v":""},{"$f":"IF(I10=\"\",\"\",VLOOKUP(N17,$A$3:$J$58,9,0))","v":""},{"$f":"IF(J10=\"\",\"\",VLOOKUP(N17,$A$3:$J$58,10,0))","v":""},null,{"$f":"IFERROR(IF(S17=\"\",\"\",RANK(S17,$S$14:$S$17)),0)","v":""},null,null,24,{"$f":"IF(H26=\"\",\"\",(VLOOKUP(W17,$A$3:$J$58,8,0)))","v":""},{"$f":"IF(I26=\"\",\"\",VLOOKUP(W17,$A$3:$J$58,9,0))","v":""},{"$f":"IF(J25=\"\",\"\",VLOOKUP(W17,$A$3:$J$58,10,0))","v":""},null,{"$f":"IFERROR(IF(AA17=\"\",\"\",RANK(AA17,$AA$14:$AA$17)),0)","v":""},null,null,40,{"$f":"IF(H42=\"\",\"\",(VLOOKUP(AE17,$A$3:$J$58,8,0)))","v":""},{"$f":"IF(I42=\"\",\"\",VLOOKUP(AE17,$A$3:$J$58,9,0))","v":""},{"$f":"IF(J42=\"\",\"\",VLOOKUP(AE17,$A$3:$J$58,10,0))","v":""},null,{"$f":"IFERROR(IF(AI17=\"\",\"\",RANK(AI17,$AI$14:$AI$17)),0)","v":""},null,null,56,{"$f":"IF(H58=\"\",\"\",(VLOOKUP(AM17,$A$3:$J$58,8,0)))","v":""},{"$f":"IF(I58=\"\",\"\",VLOOKUP(AM17,$A$3:$J$58,9,0))","v":""},{"$f":"IF(J58=\"\",\"\",VLOOKUP(AM17,$A$3:$J$58,10,0))","v":""},null,{"$f":"IFERROR(IF(AQ17=\"\",\"\",RANK(AQ17,$AQ$14:$AQ$17)),0)","v":""}]
[16,16,null,null,null,999,null,null,null,null,"",""]
[17,17,null,null,null,999,null,null,null,null,{"$f":"IF(AB5=\"\",\"\",AB5)","v":""},{"$f":"IF(AA5=\"\",\"\",AA5)","v":""}]
[18,18,null,null,null,999,null,null,null,null,{"$f":"IF(AB6=\"\",\"\",AB6)","v":""},{"$f":"IF(AA6=\"\",\"\",AA6)","v":""},null,null,null,"Tisch 3 Runde 2",null,null,null,null,null,null,null,"Tisch 7 Runde 2",null,null,null,null,null,null,null,"Tisch 11 Runde 2"]
[19,19,null,null,null,999,null,null,null,null,"",""]
[20,20,null,null,null,999,null,null,null,null,"","",null,null,null,"Vorname","Name","Alter","Punkte","Platzierung",null,null,null,"Vorname","Name","Alter","Punkte","Platzierung",null,null,null,"Vorname","Name","Alter","Punkte","Platzierung"]
[21,21,null,null,null,999,null,null,null,null,{"$f":"IF(AB14=\"\",\"\",AB14)","v":""},{"$f":"IF(AA14=\"\",\"\",AA14)","v":""},null,9,null,{"$f":"IF(H11=\"\",\"\",VLOOKUP(N23,$A$3:$J$58,8,0))","v":""},{"$f":"IF(I11=\"\",\"\",VLOOKUP(N23,$A$3:$J$58,9,0))","v":""},{"$f":"IF(J11=\"\",\"\",VLOOKUP(N23,$A$3:$J$58,10,0))","v":""},null,{"$f":"IFERROR(IF(S23=\"\",\"\",RANK(S23,$S$23:$S$26)),0)","v":""},null,null,25,{"$f":"IF(H27=\"\",\"\",(VLOOKUP(W23,$A$3:$J$58,8,0)))","v":""},{"$f":"IF(I27=\"\",\"\",VLOOKUP(W23,$A$3:$J$58,9,0))","v":""},{"$f":"IF(J27=\"\",\"\",VLOOKUP(W23,$A$3:$J$58,10,0))","v":""},null,{"$f":"IFERROR(IF(AA23=\"\",\"\",RANK(AA23,$AA$23:$AA$26)),0)","v":""},null,null,41,{"$f":"IF(H43=\"\",\"\",(VLOOKUP(AE23,$A$3:$J$58,8,0)))","v":""},{"$f":"IF(I43=\"\",\"\",VLOOKUP(AE23,$A$3:$J$58,9,0))","v":""},{"$f":"IF(J43=\"\",\"\",VLOOKUP(AE23,$A$3:$J$58,10,0))","v":""},null,{"$f":"IFERROR(IF(AI23=\"\",\"\",RANK(AI23,$AI$23:$AI$26)),0)","v":""}]
[22,22,null,null,null,999,null,null,null,null,{"$f":"IF(AB15=\"\",\"\",AB15)","v":""},{"$f":"IF(AA15=\"\",\"\",AA15)","v":""},null,10,null,{"$f":"IF(H12=\"\",\"\",VLOOKUP(N24,$A$3:$J$58,8,0))","v":""},{"$f":"IF(I12=\"\",\"\",VLOOKUP(N24,$A$3:$J$58,9,0))","v":""},{"$f":"IF(J12=\"\",\"\",VLOOKUP(N24,$A$3:$J$58,10,0))","v":""},null,{"$f":"IFERROR(IF(S24=\"\",\"\",RANK(S24,$S$23:$S$26)),0)","v":""},null,null,26,{"$f":"IF(H28=\"\",\"\",(VLOOKUP(W24,$A$3:$J$58,8,0)))","v":""},{"$f":"IF(I28=\"\",\"\",VLOOKUP(W24,$A$3:$J$58,9,0))","v":""},{"$f":"IF(J28=\"\",\"\",VLOOKUP(W24,$A$3:$J$58,10,0))","v":""},null,{"$f":"IFERROR(IF(AA24=\"\",\"\",RANK(AA24,$AA$23:$AA$26)),0)","v":""},null,null,42,{"$f":"IF(H44=\"\",\"\",(VLOOKUP(AE24,$A$3:$J$58,8,0)))","v":""},{"$f":"IF(I44=\"\",\"\",VLOOKUP(AE24,$A$3:$J$58,9,0))","v":""},{"$f":"IF(J44=\"\",\"\",VLOOKUP(AE24,$A$3:$J$58,10,0))","v":""},null,{"$f":"IFERROR(IF(AI24=\"\",\"\",RANK(AI24,$AI$23:$AI$26)),0)","v":""}]
[23,23,null,null,null,999,null,null,null,null,"","",null,11,null,{"$f":"IF(H13=\"\",\"\",VLOOKUP(N25,$A$3:$J$58,8,0))","v":""},{"$f":"IF(I13=\"\",\"\",VLOOKUP(N25,$A$3:$J$58,9,0))","v":""},{"$f":"IF(J13=\"\",\"\",VLOOKUP(N25,$A$3:$J$58,10,0))","v":""},null,{"$f":"IFERROR(IF(S25=\"\",\"\",RANK(S25,$S$23:$S$26)),0)","v":""},null,null,27,{"$f":"IF(H29=\"\",\"\",(VLOOKUP(W25,$A$3:$J$58,8,0)))","v":""},{"$f":"IF(I29=\"\",\"\",VLOOKUP(W25,$A$3:$J$58,9,0))","v":""},{"$f":"IF(J29=\"\",\"\",VLOOKUP(W25,$A$3:$J$58,10,0))","v":""},null,{"$f":"IFERROR(IF(AA25=\"\",\"\",RANK(AA25,$AA$23:$AA$26)),0)","v":""},null,null,43,{"$f":"IF(H45=\"\",\"\",(VLOOKUP(AE25,$A$3:$J$58,8,0)))","v":""},{"$f":"IF(I45=\"\",\"\",VLOOKUP(AE25,$A$3:$J$58,9,0))","v":""},{"$f":"IF(J45=\"\",\"\",VLOOKUP(AE25,$A$3:$J$58,10,0))","v":""},null,{"$f":"IFERROR(IF(AI25=\"\",\"\",RANK(AI25,$AI$23:$AI$26)),0)","v":""}]
[24,24,null,null,null,999,null,null,null,null,"","",null,12,null,{"$f":"IF(H14=\"\",\"\",VLOOKUP(N26,$A$3:$J$58,8,0))","v":""},{"$f":"IF(I14=\"\",\"\",VLOOKUP(N26,$A$3:$J$58,9,0))","v":""},{"$f":"IF(J14=\"\",\"\",VLOOKUP(N26,$A$3:$J$58,10,0))","v":""},null,{"$f":"IFERROR(IF(S26=\"\",\"\",RANK(S26,$S$23:$S$26)),0)","v":""},null,null,28,{"$f":"IF(H30=\"\",\"\",(VLOOKUP(W26,$A$3:$J$58,8,0)))","v":""},{"$f":"IF(I30=\"\",\"\",VLOOKUP(W26,$A$3:$J$58,9,0))","v":""},{"$f":"IF(J30=\"\",\"\",VLOOKUP(W26,$A$3:$J$58,10,0))","v":""},null,{"$f":"IFERROR(IF(AA26=\"\",\"\",RANK(AA26,$AA$23:$AA$26)),0)","v":""},null,null,44,{"$f":"IF(H46=\"\",\"\",(VLOOKUP(AE26,$A$3:$J$58,8,0)))","v":""},{"$f":"IF(I46=\"\",\"\",VLOOKUP(AE26,$A$3:$J$58,9,0))","v":""},{"$f":"IF(J46=\"\",\"\",VLOOKUP(AE26,$A$3:$J$58,10,0))","v":""},null,{"$f":"IFERROR(IF(AI26=\"\",\"\",RANK(AI26,$AI$23:$AI$26)),0)","v":""}]
[25,25,null,null,null,999,null,null,null,null,{"$f":"IF(AB23=\"\",\"\",AB23)","v":""},{"$f":"IF(AA23=\"\",\"\",AA23)","v":""}]
[26,26,null,null,null,999,null,null,null,null,{"$f":"IF(AB24=\"\",\"\",AB24)","v":""},{"$f":"IF(AA24=\"\",\"\",AA24)","v":""}]
[27,27,null,null,null,999,null,null,null,null,"","",null,null,null,"Tisch 4 Runde 2",null,null,null,null,null,null,null,"Tisch 8 Runde 2",null,null,null,null,null,null,null,"Tisch 12 Runde 2"]
[28,28,null,null,null,999,null,null,null,null,"",""]
[29,29,null,null,null,999,null,null,null,null,{"$f":"IF(AB32=\"\",\"\",AB32)","v":""},{"$f":"IF(AA32=\"\",\"\",AA32)","v":""},null,null,null,"Vorname","Name","Alter","Punkte","Platzierung",null,null,null,"Vorname","Name","Alter","Punkte","Platzierung",null,null,null,"Vorname","Name","Alter","Punkte","Platzierung"]
[30,30,null,null,null,999,null,null,null,null,{"$f":"IF(AB33=\"\",\"\",AB33)","v":""},{"$f":"IF(AA33=\"\",\"\",AA33)","v":""},null,13,null,{"$f":"IF(H15=\"\",\"\",VLOOKUP(N32,$A$3:$J$58,8,0))","v":""},{"$f":"IF(I15=\"\",\"\",VLOOKUP(N32,$A$3:$J$58,9,0))","v":""},{"$f":"IF(J15=\"\",\"\",VLOOKUP(N32,$A$3:$J$58,10,0))","v":""},null,{"$f":"IFERROR(IF(S32=\"\",\"\",RANK(S32,$S$32:$S$35)),0)","v":""},null,null,29,{"$f":"IF(H31=\"\",\"\",(VLOOKUP(W32,$A$3:$J$58,8,0)))","v":""},{"$f":"IF(I31=\"\",\"\",VLOOKUP(W32,$A$3:$J$58,9,0))","v":""},{"$f":"IF(J31=\"\",\"\",VLOOKUP(W32,$A$3:$J$58,10,0))","v":""},null,{"$f":"IFERROR(IF(AA32=\"\",\"\",RANK(AA32,$AA$32:$AA$35)),0)","v":""},null,null,45,{"$f":"IF(H47=\"\",\"\",(VLOOKUP(AE32,$A$3:$J$58,8,0)))","v":""},{"$f":"IF(I47=\"\",\"\",VLOOKUP(AE32,$A$3:$J$58,9,0))","v":""},{"$f":"IF(J47=\"\",\"\",VLOOKUP(AE23,$A$3:$J$58,10,0))","v":""},null,{"$f":"IFERROR(IF(AI32=\"\",\"\",RANK(AI32,$AI$32:$AI$35)),0)","v":""}]
[31,31,null,null,null,999,null,null,null,null,"","",null,14,null,{"$f":"IF(H16=\"\",\"\",VLOOKUP(N33,$A$3:$J$58,8,0))","v":""},{"$f":"IF(I16=\"\",\"\",VLOOKUP(N33,$A$3:$J$58,9,0))","v":""},{"$f":"IF(J16=\"\",\"\",VLOOKUP(N33,$A$3:$J$58,10,0))","v":""},null,{"$f":"IFERROR(IF(S33=\"\",\"\",RANK(S33,$S$32:$S$35)),0)","v":""},null,null,30,{"$f":"IF(H32=\"\",\"\",(VLOOKUP(W33,$A$3:$J$58,8,0)))","v":""},{"$f":"IF(I32=\"\",\"\",VLOOKUP(W33,$A$3:$J$58,9,0))","v":""},{"$f":"IF(J32=\"\",\"\",VLOOKUP(W33,$A$3:$J$58,10,0))","v":""},null,{"$f":"IFERROR(IF(AA33=\"\",\"\",RANK(AA33,$AA$32:$AA$35)),0)","v":""},null,null,46,{"$f":"IF(H48=\"\",\"\",(VLOOKUP(AE33,$A$3:$J$58,8,0)))","v":""},{"$f":"IF(I48=\"\",\"\",VLOOKUP(AE33,$A$3:$J$58,9,0))","v":""},{"$f":"IF(J48=\"\",\"\",VLOOKUP(AE24,$A$3:$J$58,10,0))","v":""},null,{"$f":"IFERROR(IF(AI33=\"\",\"\",RANK(AI33,$AI$32:$AI$35)),0)","v":""}]
[32,32,null,null,null,999,null,null,null,null,"","",null,15,null,{"$f":"IF(H17=\"\",\"\",VLOOKUP(N34,$A$3:$J$58,8,0))","v":""},{"$f":"IF(I17=\"\",\"\",VLOOKUP(N34,$A$3:$J$58,9,0))","v":""},{"$f":"IF(J17=\"\",\"\",VLOOKUP(N34,$A$3:$J$58,10,0))","v":""},null,{"$f":"IFERROR(IF(S34=\"\",\"\",RANK(S34,$S$32:$S$35)),0)","v":""},null,null,31,{"$f":"IF(H33=\"\",\"\",(VLOOKUP(W34,$A$3:$J$58,8,0)))","v":""},{"$f":"IF(I33=\"\",\"\",VLOOKUP(W34,$A$3:$J$58,9,0))","v":""},{"$f":"IF(J33=\"\",\"\",VLOOKUP(W34,$A$3:$J$58,10,0))","v":""},null,{"$f":"IFERROR(IF(AA34=\"\",\"\",RANK(AA34,$AA$32:$AA$35)),0)","v":""},null,null,47,{"$f":"IF(H49=\"\",\"\",(VLOOKUP(AE34,$A$3:$J$58,8,0)))","v":""},{"$f":"IF(I49=\"\",\"\",VLOOKUP(AE34,$A$3:$J$58,9,0))","v":""},{"$f":"IF(J49=\"\",\"\",VLOOKUP(AE25,$A$3:$J$58,10,0))","v":""},null,{"$f":"IFERROR(IF(AI34=\"\",\"\",RANK(AI34,$AI$32:$AI$35)),0)","v":""}]
[33,{"$f":"IF(A35>0,A35,999)","v":33},null,null,null,{"$f":"IF(G35>0,G35,999)","v":999},null,null,null,null,{"$f":"IF(AJ5=\"\",\"\",AJ5)","v":""},{"$f":"IF(AI5=\"\",\"\",AI5)","v":""},null,16,null,{"$f":"IF(H18=\"\",\"\",VLOOKUP(N35,$A$3:$J$58,8,0))","v":""},{"$f":"IF(I18=\"\",\"\",VLOOKUP(N35,$A$3:$J$58,9,0))","v":""},{"$f":"IF(J18=\"\",\"\",VLOOKUP(N35,$A$3:$J$58,10,0))","v":""},null,{"$f":"IFERROR(IF(S35=\"\",\"\",RANK(S35,$S$32:$S$35)),0)","v":""},null,null,32,{"$f":"IF(H34=\"\",\"\",(VLOOKUP(W35,$A$3:$J$58,8,0)))","v":""},{"$f":"IF(I34=\"\",\"\",VLOOKUP(W35,$A$3:$J$58,9,0))","v":""},{"$f":"IF(J34=\"\",\"\",VLOOKUP(W35,$A$3:$J$58,10,0))","v":""},null,{"$f":"IFERROR(IF(AA35=\"\",\"\",RANK(AA35,$AA$32:$AA$35)),0)","v":""},null,null,48,{"$f":"IF(H50=\"\",\"\",(VLOOKUP(AE35,$A$3:$J$58,8,0)))","v":""},{"$f":"IF(I50=\"\",\"\",VLOOKUP(AE35,$A$3:$J$58,9,0))","v":""},{"$f":"IF(J50=\"\",\"\",VLOOKUP(AE26,$A$3:$J$58,10,0))","v":""},null,{"$f":"IFERROR(IF(AI35=\"\",\"\",RANK(AI35,$AI$32:$AI$35)),0)","v":""}]
[34,34,null,null,null,999,null,null,null,null,{"$f":"IF(AJ6=\"\",\"\",AJ6)","v":""},{"$f":"IF(AI6=\"\",\"\",AI6)","v":""}]
[35,35,null,null,null,999,null,null,null,null,"",""]
[36,36,null,null,null,999,null,null,null,null,"",""]
[37,37,null,null,null,999,null,null,null,null,{"$f":"IF(AJ14=\"\",\"\",AJ14)","v":""},{"$f":"IF(AI14=\"\",\"\",AI14)","v":""}]
[38,38,null,null,null,999,null,null,null,null,{"$f":"IF(AJ15=\"\",\"\",AJ15)","v":""},{"$f":"IF(AI15=\"\",\"\",AI15)","v":""},null,null,null,{"$f":"IF(AND(P5>\"\",OR(S5=\"\",S6=\"\",S7=\"\",S8=\"\")),AH1,IF(AND(P14>\"\",OR(S14=\"\",S15=\"\",S16=\"\",S17=\"\")),AH1,IF(AND(P23>\"\",OR(S23=\"\",S24=\"\",S25=\"\",S26=\"\")),AH1,IF(AND(P32>\"\",OR(S32=\"\",S33=\"\",S34=\"\",S35=\"\")),AH1,IF(AND(X5>\"\",OR(AA5=\"\",AA6=\"\",AA7=\"\",AA8=\"\")),AH1,IF(AND(X14>\"\",OR(AA14=\"\",AA15=\"\",AA16=\"\",AA17=\"\")),AH1,IF(AND(X23>\"\",OR(AA23=\"\",AA24=\"\",AA25=\"\",AA26=\"\")),AH1,IF(AND(X32>\"\",OR(AA32=\"\",AA33=\"\",AA34=\"\",AA35=\"\")),AH1,IF(AND(AF5>\"\",OR(AI5=\"\",AI6=\"\",AI7=\"\",AI8=\"\")),AH1,IF(AND(AF14>\"\",OR(AI14=\"\",AI15=\"\",AI16=\"\",AI17=\"\")),AH1,IF(AND(AF23>\"\",OR(AI23=\"\",AI24=\"\",AI25=\"\",AI26=\"\")),AH1,IF(AND(AF32>\"\",OR(AI32=\"\",AI33=\"\",AI34=\"\",AI35=\"\")),AH1,IF(AND(AN5>\"\",OR(AQ5=\"\",AQ6=\"\",AQ7=\"\",AQ8=\"\")),AH1,IF(AND(AN14>\"\",OR(AQ14=\"\",AQ15=\"\",AQ16=\"\",AQ17=\"\")),AH1,IF(AND(L7<>\"\",H7=\"\"),AH2,IF(AND(L8<>\"\",H8=\"\"),AG1,IF(AND(L9<>\"\",H9=\"\"),AG1,IF(AND(L10<>\"\",H10=\"\"),AG1,AK1))))))))))))))))))","v":"Eingabe o.k."},null,null,null,null,null,null,null,null,null,null,null,null,null,null,null,{"$f":"IF(AND(P5>\"\",OR(S5=\"\",S6=\"\",S7=\"\",S8=\"\")),AH1,IF(AND(P14>\"\",OR(S14=\"\",S15=\"\",S16=\"\",S17=\"\")),AH1,IF(AND(P23>\"\",OR(S23=\"\",S24=\"\",S25=\"\",S26=\"\")),AH1,IF(AND(P32>\"\",OR(S32=\"\",S33=\"\",S34=\"\",S35=\"\")),AH1,IF(AND(X5>\"\",OR(AA5=\"\",AA6=\"\",AA7=\"\",AA8=\"\")),AH1,IF(AND(X14>\"\",OR(AA14=\"\",AA15=\"\",AA16=\"\",AA17=\"\")),AH1,IF(AND(X23>\"\",OR(AA23=\"\",AA24=\"\",AA25=\"\",AA26=\"\")),AH1,IF(AND(X32>\"\",OR(AA32=\"\",AA33=\"\",AA34=\"\",AA35=\"\")),AH1,IF(AND(AF5>\"\",OR(AI5=\"\",AI6=\"\",AI7=\"\",AI8=\"\")),AH1,IF(AND(AF14>\"\",OR(AI14=\"\",AI15=\"\",AI16=\"\",AI17=\"\")),AH1,IF(AND(AF23>\"\",OR(AI23=\"\",AI24=\"\",AI25=\"\",AI26=\"\")),AH1,IF(AND(AF32>\"\",OR(AI32=\"\",AI33=\"\",AI34=\"\",AI35=\"\")),AH1,IF(AND(AN5>\"\",OR(AQ5=\"\",AQ6=\"\",AQ7=\"\",AQ8=\"\")),AH1,IF(AND(AN14>\"\",OR(AQ14=\"\",AQ15=\"\",AQ16=\"\",AQ17=\"\")),AH1,IF(AND(L7<>\"\",H7=\"\"),AH2,IF(AND(L8<>\"\",H8=\"\"),AG1,IF(AND(L9<>\"\",H9=\"\"),AG1,IF(AND(L10<>\"\",H10=\"\"),AG1,AK1))))))))))))))))))","v":"Eingabe o.k."}]
[39,39,null,null,null,999,null,null,null,null,"",""]
[40,40,null,null,null,999,null,null,null,null,"",""]
[41,41,null,null,null,999,null,null,null,null,{"$f":"IF(AJ23=\"\",\"\",AJ23)","v":""},{"$f":"IF(AI23=\"\",\"\",AI23)","v":""}]
[42,42,null,null,null,999,null,null,null,null,{"$f":"IF(AJ24=\"\",\"\",AJ24)","v":""},{"$f":"IF(AI24=\"\",\"\",AI24)","v":""}]
[43,43,null,null,null,999,null,null,null,null,"",""]
[44,44,null,null,null,999,null,null,null,null,"",""]
[45,45,null,null,null,999,null,null,null,null,{"$f":"IF(AJ32=\"\",\"\",AJ32)","v":""},{"$f":"IF(AI32=\"\",\"\",AI32)","v":""}]
[46,46,null,null,null,999,null,null,null,null,{"$f":"IF(AJ33=\"\",\"\",AJ33)","v":""},{"$f":"IF(AI33=\"\",\"\",AI33)","v":""}]
[47,47,null,null,null,999,null,null,null,null,"",""]
[48,48,null,null,null,999,null,null,null,null,"",""]
[49,49,null,null,null,999,null,null,null,null,{"$f":"IF(AR5=\"\",\"\",AR5)","v":""},{"$f":"IF(AQ5=\"\",\"\",AQ5)","v":""}]
[50,50,null,null,null,999,null,null,null,null,{"$f":"IF(AR6=\"\",\"\",AR6)","v":""},{"$f":"IF(AQ6=\"\",\"\",AQ6)","v":""}]
[51,51,null,null,null,999,null,null,null,null,"",""]
[52,52,null,null,null,999,null,null,null,null,"",""]
[null,null,null,null,null,999,null,null,null,null,{"$f":"IF(AR14=\"\",\"\",AR14)","v":""},{"$f":"IF(AQ14=\"\",\"\",AQ14)","v":""}]
[null,null,null,null,null,999,null,null,null,null,{"$f":"IF(AR15=\"\",\"\",AR15)","v":""},{"$f":"IF(AQ15=\"\",\"\",AQ15)","v":""}]
[null,null,null,null,null,999,null,null,null,null,"",""]
[null,null,null,null,null,999,null,null,null,null,"",""]
[null,null,null,null,null,999]
[null,null,null,null,null,999]

{"sheet":"Auswertung Runde 2","index":6,"n_rows":21,"n_cols":3,"rows_kept":21,"cut":false,"hidden":true,"merged":[]}
["Vorname","Name","Alter"]
["Test16","16",115]
["Test17","17",116]
["Test62","62",161]
["Test49","49",148]
["Test28","28",127]
["Test3","3",102]
["Test67","67",166]
["Test58","58",157]
["Test31","31",130]
["Test60","60",159]
["Test22","22",121]
["Test24","24",123]
["Test47","47",146]
["Test15","15",114]
["Test35","35",134]
["Test20","20",119]
["Test37","37",136]
["Test48","48",147]
["Test68","68",167]
["Test27","27",126]

{"sheet":"Teilnehmer 3.Runde","index":7,"n_rows":129,"n_cols":7,"rows_kept":129,"cut":false,"hidden":true,"merged":[]}
[]
[]
[]
[]
[]
[null,null,null,"Nr.:","Vorname","Name","Alter"]
[{"$f":"IF(E7=\"\",\"x\",\"\")","v":""},{"$f":"RAND()","v":3.9027580184699207E-2},null,null,"Test28","28",127]
["",0.40250638300428176,null,null,"Test20","20",119]
["",0.22013383612035797,null,null,"Test3","3",102]
["",0.7337968161921965,null,null,"Test60","60",159]
["",0.96349842577600819,null,null,"Test35","35",134]
["",0.18573930292761809,null,null,"Test67","67",166]
["",0.29844306664543008,null,null,"Test58","58",157]
["",0.44362766515506569,{"$f":"RANK(B14,#REF!)","v":{"$error":"#REF!"}},null,"Test49","49",148]
["",0.29727572693855797,null,null,"Test16","16",115]
["",1.4892410260514244E-2,null,null,"Test47","47",146]
["",1.3732693952401509E-2,null,null,"Test27","27",126]
["",0.3225813521090013,null,null,"Test48","48",147]
["",0.41146089823325416,null,null,"Test15","15",114]
["",0.53318970645558605,null,null,"Test17","17",116]
["",0.65381330590194142,{"$f":"RANK(B21,#REF!)","v":{"$error":"#REF!"}},null,"Test31","31",130]
["",0.48198444439666666,null,null,"Test62","62",161]
["",0.31963325908112461,null,null,"Test37","37",136]
["",0.75529404932729738,null,null,"Test22","22",121]
["",0.18289107675374439,null,null,"Test68","68",167]
["",0.55756947848561711,null,null,"Test24","24",123]
[]
[]
[]
[]
[]
[]
[]
[]
[]
[]
[]
[]
[]
[]
[]
[]
[]
[]
[]
[]
[]
[]
[]
[]
[]
[]
[]
[]
[]
[]
[]
[]
[]
[]
[]
[]
[]
[]
[]
[]
[]
[]
[]
[]
[]
[]
[]
[]
[]
[]
[]
[]
[]
[]
[]
[]
[]
[]
[]
[]
[]
[]
[]
[]
[]
[]
[]
[]
[]
[]
[]
[]
[]
[]
[]
[]
[]
[]
[]
[]
[]
[]
[]
[]
[]
[]
[]
[]
[]
[]
[]
[]
[]
[]
[]
[]
[]
[]
[]
[]
[]
[]
[{"$f":"IF(F129>\"\",B129,IF(G129>\"\",B129,\"\"))","v":""}]

{"sheet":"Runde 3","index":8,"n_rows":128,"n_cols":44,"rows_kept":128,"cut":false,"hidden":false,"merged":[[1,35,2,35],[1,39,2,42],[1,43,2,43],[10,31,11,34],[10,35,11,35],[10,39,11,42],[10,43,11,43],[1,31,2,34],[19,35,20,35],[19,39,20,42],[19,43,20,43],[28,31,29,34],[28,35,29,35],[28,39,29,42],[28,43,29,43],[19,31,20,34],[39,15,41,27],[1,15,2,19],[10,15,11,19],[19,15,20,19],[28,15,29,19],[1,23,2,27],[10,23,11,27],[19,23,20,27],[28,23,29,27]]}
[null,null,null,null,null,null,null,null,null,null,null,null,null,null,null,"3.Runde starten >",null,null,null,null,null,null,null,null,null,null,null,null,null,null,null,{"$f":"IF(P40=\"Eingabe o.k.\",1,\"\")","v":1},"Es wurden Punkte eingetragen für die kein Spieler zugeordnet ist !!!","Es wurden nicht für jeden Spieler Punkte in dieser Runde eingetragen !!!",null,null,{"$f":"IF(AND(L10<>\"\",H10=\"\"),AG1,IF(AND(L11<>\"\",H11=\"\"),AG1,IF(AND(L12<>\"\",H12=\"\"),AG1,IF(AND(L13<>\"\",H13=\"\"),AG1,IF(AND(L14<>\"\",H14=\"\"),AG1,IF(AND(L15<>\"\",H15=\"\"),AG1,IF(AND(L16<>\"\",H16=\"\"),AG1,IF(AND(L17<>\"\",H17=\"\"),AG1,IF(AND(L18<>\"\",H18=\"\"),AG1,IF(AND(L19<>\"\",H19=\"\"),AG1,IF(AND(L20<>\"\",H20=\"\"),AG1,IF(AND(L21<>\"\",H21=\"\"),AG1,IF(AND(L22<>\"\",H22=\"\"),AG1,IF(AND(L23<>\"\",H23=\"\"),AG1,IF(AND(L24<>\"\",H24=\"\"),AG1,IF(AND(L25<>\"\",H25=\"\"),AG1,IF(AND(L26<>\"\",H26=\"\"),AG1,IF(AND(L27<>\"\",H27=\"\"),AG1,IF(AND(L28<>\"\",H28=\"\"),AG1,IF(AND(L29<>\"\",H29=\"\"),AG1,IF(AND(L30<>\"\",H30=\"\"),AG1,IF(AND(L31<>\"\",H31=\"\"),AG1,IF(AND(L32<>\"\",H32=\"\"),AG1,IF(AND(L33<>\"\",H33=\"\"),AG1,IF(AND(L34<>\"\",H34=\"\"),AG1,\"Eingabe o.k.\")))))))))))))))))))))))))","v":"Eingabe o.k."}]
[null,null,null,null,null,null,null,"Vorname","Name","Alter","Platzierung","Punkte",null,null,null,{"$f":"IF(ISTEXT('Teilnehmer Erfassung'!Q2),\"Tisch 1 Rund 3\",IF('Teilnehmer Erfassung'!Q2=4,\"Finale\",IF('Teilnehmer Erfassung'!Q2=8,\"Halbfinale 1\",\"Tisch 1 Runde 3\")))","v":"Tisch 1 Rund 3"},null,null,null,null,null,null,null,"Tisch 5 Runde 3",null,null,null,null,null,null,null,"Tisch 9 Runde 3",null,null,null,null,null,null,null,"Tisch 13 Runde 3"]
[1,{"$f":"IF(A3>0,A3,999)","v":1},null,null,null,{"$f":"IF(G3>0,G3,999)","v":999},null,null,null,null,{"$f":"IF(T5=\"\",\"\",T5)","v":""},{"$f":"IF(S5=\"\",\"\",S5)","v":""}]
[2,2,null,null,null,999,null,null,null,null,{"$f":"IF(T6=\"\",\"\",T6)","v":""},{"$f":"IF(S6=\"\",\"\",S6)","v":""},null,null,null,"Vorname","Name","Alter","Punkte","Platzierung",null,null,null,"Vorname","Name","Alter","Punkte","Platzierung",null,null,null,"Vorname","Name","Alter","Punkte","Platzierung",null,null,null,"Vorname","Name","Alter","Punkte","Platzierung"]
[3,3,null,null,null,999,null,null,null,null,{"$f":"IF(T7=\"\",\"\",T7)","v":""},"",null,1,null,{"$f":"IF(H3=\"\",\"\",VLOOKUP(N5,$A$3:$J$132,8,0))","v":""},{"$f":"IF(I3=\"\",\"\",VLOOKUP(N5,$A$3:$J$132,9,0))","v":""},{"$f":"IF(J3=\"\",\"\",VLOOKUP(N5,$A$3:$J$132,10,0))","v":""},null,{"$f":"IFERROR(IF(S5=\"\",\"\",RANK(S5,$S$5:$S$8)),0)","v":""},{"$f":"IF(P5=\"\",0,1)","v":0},null,17,{"$f":"IF(H19=\"\",\"\",VLOOKUP(W5,$A$3:$J$132,8,0))","v":""},{"$f":"IF(I19=\"\",\"\",VLOOKUP(W5,$A$3:$J$132,9,0))","v":""},{"$f":"IF(J19=\"\",\"\",VLOOKUP(W5,$A$3:$J$132,10,0))","v":""},null,{"$f":"IFERROR(IF(AA5=\"\",\"\",RANK(AA5,$AA$5:$AA$8)),0)","v":""},{"$f":"IF(X5=\"\",0,1)","v":0},null,33,{"$f":"IF(G35=\"\",\"\",(VLOOKUP(AE5,$A$3:$J$132,8,0)))","v":""},{"$f":"IF(G35=\"\",\"\",VLOOKUP(AE5,$A$3:$J$132,9,0))","v":""},{"$f":"IF(G35=\"\",\"\",VLOOKUP(AE5,$A$3:$J$132,10,0))","v":""},100,{"$f":"IFERROR(IF(AI5=\"\",\"\",RANK(AI5,$AI$5:$AI$8)),0)","v":2},null,null,49,{"$f":"IF(#REF!=\"\",\"\",(VLOOKUP(AM5,$A$3:$J$322,8,0)))","v":{"$error":"#REF!"}},{"$f":"IF(#REF!=\"\",\"\",VLOOKUP(AM5,$A$3:$J$132,9,0))","v":{"$error":"#REF!"}},{"$f":"IF(#REF!=\"\",\"\",VLOOKUP(AM5,$A$3:$J$132,10,0))","v":{"$error":"#REF!"}},null,{"$f":"IFERROR(IF(AQ5=\"\",\"\",RANK(AQ5,$AQ$5:$AQ$8)),0)","v":""}]
[4,4,null,null,null,999,null,null,null,null,{"$f":"IF(T8=\"\",\"\",T8)","v":""},"",null,2,null,{"$f":"IF(H4=\"\",\"\",VLOOKUP(N6,$A$3:$J$132,8,0))","v":""},{"$f":"IF(I4=\"\",\"\",VLOOKUP(N6,$A$3:$J$132,9,0))","v":""},{"$f":"IF(J4=\"\",\"\",VLOOKUP(N6,$A$3:$J$132,10,0))","v":""},null,{"$f":"IFERROR(IF(S6=\"\",\"\",RANK(S6,$S$5:$S$8)),0)","v":""},null,null,18,{"$f":"IF(H20=\"\",\"\",VLOOKUP(W6,$A$3:$J$132,8,0))","v":""},{"$f":"IF(I20=\"\",\"\",VLOOKUP(W6,$A$3:$J$132,9,0))","v":""},{"$f":"IF(J20=\"\",\"\",VLOOKUP(W6,$A$3:$J$132,10,0))","v":""},null,{"$f":"IFERROR(IF(AA6=\"\",\"\",RANK(AA6,$AA$5:$AA$8)),0)","v":""},null,null,34,{"$f":"IF(G36=\"\",\"\",(VLOOKUP(AE6,$A$3:$J$132,8,0)))","v":""},{"$f":"IF(G36=\"\",\"\",VLOOKUP(AE6,$A$3:$J$132,9,0))","v":""},{"$f":"IF(G36=\"\",\"\",VLOOKUP(AE6,$A$3:$J$132,10,0))","v":""},50,{"$f":"IFERROR(IF(AI6=\"\",\"\",RANK(AI6,$AI$5:$AI$8)),0)","v":3},null,null,50,{"$f":"IF(#REF!=\"\",\"\",(VLOOKUP(AM6,$A$3:$J$322,8,0)))","v":{"$error":"#REF!"}},{"$f":"IF(#REF!=\"\",\"\",VLOOKUP(AM6,$A$3:$J$132,9,0))","v":{"$error":"#REF!"}},{"$f":"IF(#REF!=\"\",\"\",VLOOKUP(AM6,$A$3:$J$132,10,0))","v":{"$error":"#REF!"}},null,{"$f":"IFERROR(IF(AQ6=\"\",\"\",RANK(AQ6,$AQ$5:$AQ$8)),0)","v":""}]
[5,5,null,null,null,999,null,null,null,null,{"$f":"IF(T14=\"\",\"\",T14)","v":""},{"$f":"IF(S14=\"\",\"\",S14)","v":""},null,3,null,{"$f":"IF(H5=\"\",\"\",VLOOKUP(N7,$A$3:$J$132,8,0))","v":""},{"$f":"IF(I5=\"\",\"\",VLOOKUP(N7,$A$3:$J$132,9,0))","v":""},{"$f":"IF(J5=\"\",\"\",VLOOKUP(N7,$A$3:$J$132,10,0))","v":""},null,{"$f":"IFERROR(IF(S7=\"\",\"\",RANK(S7,$S$5:$S$8)),0)","v":""},null,null,19,{"$f":"IF(H21=\"\",\"\",VLOOKUP(W7,$A$3:$J$132,8,0))","v":""},{"$f":"IF(I21=\"\",\"\",VLOOKUP(W7,$A$3:$J$132,9,0))","v":""},{"$f":"IF(J21=\"\",\"\",VLOOKUP(W7,$A$3:$J$132,10,0))","v":""},null,{"$f":"IFERROR(IF(AA7=\"\",\"\",RANK(AA7,$AA$5:$AA$8)),0)","v":""},null,null,35,{"$f":"IF(G37=\"\",\"\",(VLOOKUP(AE7,$A$3:$J$132,8,0)))","v":""},{"$f":"IF(G37=\"\",\"\",VLOOKUP(AE7,$A$3:$J$132,9,0))","v":""},{"$f":"IF(G37=\"\",\"\",VLOOKUP(AE7,$A$3:$J$132,10,0))","v":""},20,{"$f":"IFERROR(IF(AI7=\"\",\"\",RANK(AI7,$AI$5:$AI$8)),0)","v":4},null,null,51,{"$f":"IF(#REF!=\"\",\"\",(VLOOKUP(AM7,$A$3:$J$322,8,0)))","v":{"$error":"#REF!"}},{"$f":"IF(#REF!=\"\",\"\",VLOOKUP(AM7,$A$3:$J$132,9,0))","v":{"$error":"#REF!"}},{"$f":"IF(#REF!=\"\",\"\",VLOOKUP(AM7,$A$3:$J$132,10,0))","v":{"$error":"#REF!"}},null,{"$f":"IFERROR(IF(AQ7=\"\",\"\",RANK(AQ7,$AQ$5:$AQ$8)),0)","v":""}]
[6,6,null,null,null,999,null,null,null,null,{"$f":"IF(T15=\"\",\"\",T15)","v":""},{"$f":"IF(S15=\"\",\"\",S15)","v":""},null,4,null,{"$f":"IF(H6=\"\",\"\",VLOOKUP(N8,$A$3:$J$132,8,0))","v":""},{"$f":"IF(I6=\"\",\"\",VLOOKUP(N8,$A$3:$J$132,9,0))","v":""},{"$f":"IF(J6=\"\",\"\",VLOOKUP(N8,$A$3:$J$132,10,0))","v":""},null,{"$f":"IFERROR(IF(S8=\"\",\"\",RANK(S8,$S$5:$S$8)),0)","v":""},null,null,20,{"$f":"IF(H22=\"\",\"\",VLOOKUP(W8,$A$3:$J$132,8,0))","v":""},{"$f":"IF(I22=\"\",\"\",VLOOKUP(W8,$A$3:$J$132,9,0))","v":""},{"$f":"IF(J22=\"\",\"\",VLOOKUP(W8,$A$3:$J$132,10,0))","v":""},null,{"$f":"IFERROR(IF(AA8=\"\",\"\",RANK(AA8,$AA$5:$AA$8)),0)","v":""},null,null,36,{"$f":"IF(G38=\"\",\"\",(VLOOKUP(AE8,$A$3:$J$132,8,0)))","v":""},{"$f":"IF(G38=\"\",\"\",VLOOKUP(AE8,$A$3:$J$132,9,0))","v":""},{"$f":"IF(G38=\"\",\"\",VLOOKUP(AE8,$A$3:$J$132,10,0))","v":""},200,{"$f":"IFERROR(IF(AI8=\"\",\"\",RANK(AI8,$AI$5:$AI$8)),0)","v":1},null,null,52,{"$f":"IF(#REF!=\"\",\"\",(VLOOKUP(AM8,$A$3:$J$322,8,0)))","v":{"$error":"#REF!"}},{"$f":"IF(#REF!=\"\",\"\",VLOOKUP(AM8,$A$3:$J$132,9,0))","v":{"$error":"#REF!"}},{"$f":"IF(#REF!=\"\",\"\",VLOOKUP(AM8,$A$3:$J$132,10,0))","v":{"$error":"#REF!"}},null,{"$f":"IFERROR(IF(AQ8=\"\",\"\",RANK(AQ8,$AQ$5:$AQ$8)),0)","v":""}]
[7,7,null,null,null,999,null,null,null,null,{"$f":"IF(T16=\"\",\"\",T16)","v":""},""]
[8,8,null,null,null,999,null,null,null,null,{"$f":"IF(T17=\"\",\"\",T17)","v":""},""]
[9,9,null,null,null,999,null,null,null,null,{"$f":"IF(T23=\"\",\"\",T23)","v":""},{"$f":"IF(S23=\"\",\"\",S23)","v":""},null,null,null,{"$f":"IF(ISTEXT('Teilnehmer Erfassung'!Q2),\"Tisch 2 Rund 3\",IF('Teilnehmer Erfassung'!Q2=8,\"Halbfinale 2\",\"Tisch 2 Runde 3\"))","v":"Tisch 2 Rund 3"},null,null,null,null,null,null,null,"Tisch 6 Runde 3",null,null,null,null,null,null,null,"Tisch 10 Runde 3",null,null,null,null,null,null,null,"Tisch 14 Runde 3"]
[10,10,null,null,null,999,null,null,null,null,{"$f":"IF(T24=\"\",\"\",T24)","v":""},{"$f":"IF(S24=\"\",\"\",S24)","v":""}]
[11,11,null,null,null,999,null,null,null,null,{"$f":"IF(T25=\"\",\"\",T25)","v":""},"",null,null,null,"Vorname","Name","Alter","Punkte","Platzierung",null,null,null,"Vorname","Name","Alter","Punkte","Platzierung",null,null,null,"Vorname","Name","Alter","Punkte","Platzierung",null,null,null,"Vorname","Name","Alter","Punkte","Platzierung"]
[12,12,null,null,null,999,null,null,null,null,{"$f":"IF(T26=\"\",\"\",T26)","v":""},"",null,5,null,{"$f":"IF(H7=\"\",\"\",VLOOKUP(N14,$A$3:$J$132,8,0))","v":""},{"$f":"IF(I7=\"\",\"\",VLOOKUP(N14,$A$3:$J$132,9,0))","v":""},{"$f":"IF(J7=\"\",\"\",VLOOKUP(N14,$A$3:$J$132,10,0))","v":""},null,{"$f":"IFERROR(IF(S14=\"\",\"\",RANK(S14,$S$14:$S$17)),0)","v":""},null,null,21,{"$f":"IF(H23=\"\",\"\",(VLOOKUP(W14,$A$3:$J$132,8,0)))","v":""},{"$f":"IF(I23=\"\",\"\",VLOOKUP(W14,$A$3:$J$132,9,0))","v":""},{"$f":"IF(J23=\"\",\"\",VLOOKUP(W14,$A$3:$J$132,10,0))","v":""},null,{"$f":"IFERROR(IF(AA14=\"\",\"\",RANK(AA14,$AA$14:$AA$17)),0)","v":""},null,null,37,{"$f":"IF(G39=\"\",\"\",(VLOOKUP(AE14,$A$3:$J$132,8,0)))","v":""},{"$f":"IF(G39=\"\",\"\",VLOOKUP(AE14,$A$3:$J$132,9,0))","v":""},{"$f":"IF(G39=\"\",\"\",VLOOKUP(AE14,$A$3:$J$132,10,0))","v":""},null,{"$f":"IFERROR(IF(AI14=\"\",\"\",RANK(AI14,$AI$14:$AI$17)),0)","v":""},null,null,53,{"$f":"IF(#REF!=\"\",\"\",(VLOOKUP(AM14,$A$3:$J$132,8,0)))","v":{"$error":"#REF!"}},{"$f":"IF(#REF!=\"\",\"\",VLOOKUP(AM14,$A$3:$J$132,9,0))","v":{"$error":"#REF!"}},{"$f":"IF(#REF!=\"\",\"\",VLOOKUP(AM14,$A$3:$J$132,10,0))","v":{"$error":"#REF!"}},null,{"$f":"IFERROR(IF(AQ14=\"\",\"\",RANK(AQ14,$AQ$14:$AQ$17)),0)","v":""}]
[13,13,null,null,null,999,null,null,null,null,{"$f":"IF(T32=\"\",\"\",T32)","v":""},{"$f":"IF(S32=\"\",\"\",S32)","v":""},null,6,null,{"$f":"IF(H8=\"\",\"\",VLOOKUP(N15,$A$3:$J$132,8,0))","v":""},{"$f":"IF(I8=\"\",\"\",VLOOKUP(N15,$A$3:$J$132,9,0))","v":""},{"$f":"IF(J8=\"\",\"\",VLOOKUP(N15,$A$3:$J$132,10,0))","v":""},null,{"$f":"IFERROR(IF(S15=\"\",\"\",RANK(S15,$S$14:$S$17)),0)","v":""},null,null,22,{"$f":"IF(H24=\"\",\"\",(VLOOKUP(W15,$A$3:$J$132,8,0)))","v":""},{"$f":"IF(I24=\"\",\"\",VLOOKUP(W15,$A$3:$J$132,9,0))","v":""},{"$f":"IF(J24=\"\",\"\",VLOOKUP(W15,$A$3:$J$132,10,0))","v":""},null,{"$f":"IFERROR(IF(AA15=\"\",\"\",RANK(AA15,$AA$14:$AA$17)),0)","v":""},null,null,38,{"$f":"IF(G40=\"\",\"\",(VLOOKUP(AE15,$A$3:$J$132,8,0)))","v":""},{"$f":"IF(G40=\"\",\"\",VLOOKUP(AE15,$A$3:$J$132,9,0))","v":""},{"$f":"IF(G40=\"\",\"\",VLOOKUP(AE15,$A$3:$J$132,10,0))","v":""},null,{"$f":"IFERROR(IF(AI15=\"\",\"\",RANK(AI15,$AI$14:$AI$17)),0)","v":""},null,null,54,{"$f":"IF(#REF!=\"\",\"\",(VLOOKUP(AM15,$A$3:$J$132,8,0)))","v":{"$error":"#REF!"}},{"$f":"IF(#REF!=\"\",\"\",VLOOKUP(AM15,$A$3:$J$132,9,0))","v":{"$error":"#REF!"}},{"$f":"IF(#REF!=\"\",\"\",VLOOKUP(AM15,$A$3:$J$132,10,0))","v":{"$error":"#REF!"}},null,{"$f":"IFERROR(IF(AQ15=\"\",\"\",RANK(AQ15,$AQ$14:$AQ$17)),0)","v":""}]
[14,14,null,null,null,999,null,null,null,null,{"$f":"IF(T33=\"\",\"\",T33)","v":""},{"$f":"IF(S33=\"\",\"\",S33)","v":""},null,7,null,{"$f":"IF(H9=\"\",\"\",VLOOKUP(N16,$A$3:$J$132,8,0))","v":""},{"$f":"IF(I9=\"\",\"\",VLOOKUP(N16,$A$3:$J$132,9,0))","v":""},{"$f":"IF(J9=\"\",\"\",VLOOKUP(N16,$A$3:$J$132,10,0))","v":""},null,{"$f":"IFERROR(IF(S16=\"\",\"\",RANK(S16,$S$14:$S$17)),0)","v":""},null,null,23,{"$f":"IF(H25=\"\",\"\",(VLOOKUP(W16,$A$3:$J$132,8,0)))","v":""},{"$f":"IF(I25=\"\",\"\",VLOOKUP(W16,$A$3:$J$132,9,0))","v":""},{"$f":"IF(J25=\"\",\"\",VLOOKUP(W16,$A$3:$J$132,10,0))","v":""},null,{"$f":"IFERROR(IF(AA16=\"\",\"\",RANK(AA16,$AA$14:$AA$17)),0)","v":""},null,null,39,{"$f":"IF(G41=\"\",\"\",(VLOOKUP(AE16,$A$3:$J$132,8,0)))","v":""},{"$f":"IF(G41=\"\",\"\",VLOOKUP(AE16,$A$3:$J$132,9,0))","v":""},{"$f":"IF(G41=\"\",\"\",VLOOKUP(AE16,$A$3:$J$132,10,0))","v":""},null,{"$f":"IFERROR(IF(AI16=\"\",\"\",RANK(AI16,$AI$14:$AI$17)),0)","v":""},null,null,55,{"$f":"IF(#REF!=\"\",\"\",(VLOOKUP(AM16,$A$3:$J$132,8,0)))","v":{"$error":"#REF!"}},{"$f":"IF(#REF!=\"\",\"\",VLOOKUP(AM16,$A$3:$J$132,9,0))","v":{"$error":"#REF!"}},{"$f":"IF(#REF!=\"\",\"\",VLOOKUP(AM16,$A$3:$J$132,10,0))","v":{"$error":"#REF!"}},null,{"$f":"IFERROR(IF(AQ16=\"\",\"\",RANK(AQ16,$AQ$14:$AQ$17)),0)","v":""}]
[15,15,null,null,null,999,null,null,null,null,{"$f":"IF(T34=\"\",\"\",T34)","v":""},"",null,8,null,{"$f":"IF(H10=\"\",\"\",VLOOKUP(N17,$A$3:$J$132,8,0))","v":""},{"$f":"IF(I10=\"\",\"\",VLOOKUP(N17,$A$3:$J$132,9,0))","v":""},{"$f":"IF(J10=\"\",\"\",VLOOKUP(N17,$A$3:$J$132,10,0))","v":""},null,{"$f":"IFERROR(IF(S17=\"\",\"\",RANK(S17,$S$14:$S$17)),0)","v":""},null,null,24,{"$f":"IF(H26=\"\",\"\",(VLOOKUP(W17,$A$3:$J$132,8,0)))","v":""},{"$f":"IF(I26=\"\",\"\",VLOOKUP(W17,$A$3:$J$132,9,0))","v":""},{"$f":"IF(J26=\"\",\"\",VLOOKUP(W17,$A$3:$J$132,10,0))","v":""},null,{"$f":"IFERROR(IF(AA17=\"\",\"\",RANK(AA17,$AA$14:$AA$17)),0)","v":""},null,null,40,{"$f":"IF(G42=\"\",\"\",(VLOOKUP(AE17,$A$3:$J$132,8,0)))","v":""},{"$f":"IF(G42=\"\",\"\",VLOOKUP(AE17,$A$3:$J$132,9,0))","v":""},{"$f":"IF(G42=\"\",\"\",VLOOKUP(AE17,$A$3:$J$132,10,0))","v":""},null,{"$f":"IFERROR(IF(AI17=\"\",\"\",RANK(AI17,$AI$14:$AI$17)),0)","v":""},null,null,56,{"$f":"IF(#REF!=\"\",\"\",(VLOOKUP(AM17,$A$3:$J$132,8,0)))","v":{"$error":"#REF!"}},{"$f":"IF(#REF!=\"\",\"\",VLOOKUP(AM17,$A$3:$J$132,9,0))","v":{"$error":"#REF!"}},{"$f":"IF(#REF!=\"\",\"\",VLOOKUP(AM17,$A$3:$J$132,10,0))","v":{"$error":"#REF!"}},null,{"$f":"IFERROR(IF(AQ17=\"\",\"\",RANK(AQ17,$AQ$14:$AQ$17)),0)","v":""}]
[16,16,null,null,null,999,null,null,null,null,{"$f":"IF(T35=\"\",\"\",T35)","v":""},""]
[17,17,null,null,null,999,null,null,null,null,{"$f":"IF(AB5=\"\",\"\",AB5)","v":""},{"$f":"IF(AA5=\"\",\"\",AA5)","v":""}]
[18,18,null,null,null,999,null,null,null,null,{"$f":"IF(AB6=\"\",\"\",AB6)","v":""},{"$f":"IF(AA6=\"\",\"\",AA6)","v":""},null,null,null,"Tisch 3 Runde 3",null,null,null,null,null,null,null,"Tisch 7 Runde 3",null,null,null,null,null,null,null,"Tisch 11 Runde 3",null,null,null,null,null,null,null,"Tisch 15 Runde 3"]
[19,19,null,null,null,999,null,null,null,null,{"$f":"IF(AB7=\"\",\"\",AB7)","v":""},""]
[20,20,null,null,null,999,null,null,null,null,{"$f":"IF(AB8=\"\",\"\",AB8)","v":""},"",null,null,null,"Vorname","Name","Alter","Punkte","Platzierung",null,null,null,"Vorname","Name","Alter","Punkte","Platzierung",null,null,null,"Vorname","Name","Alter","Punkte","Platzierung",null,null,null,"Vorname","Name","Alter","Punkte","Platzierung"]
[21,21,null,null,null,999,null,null,null,null,{"$f":"IF(AB14=\"\",\"\",AB14)","v":""},{"$f":"IF(AA14=\"\",\"\",AA14)","v":""},null,9,null,{"$f":"IF(H11=\"\",\"\",VLOOKUP(N23,$A$3:$J$132,8,0))","v":""},{"$f":"IF(I11=\"\",\"\",VLOOKUP(N23,$A$3:$J$132,9,0))","v":""},{"$f":"IF(J11=\"\",\"\",VLOOKUP(N23,$A$3:$J$132,10,0))","v":""},null,{"$f":"IFERROR(IF(S23=\"\",\"\",RANK(S23,$S$23:$S$26)),0)","v":""},null,null,25,{"$f":"IF(H27=\"\",\"\",(VLOOKUP(W23,$A$3:$J$132,8,0)))","v":""},{"$f":"IF(I27=\"\",\"\",VLOOKUP(W23,$A$3:$J$132,9,0))","v":""},{"$f":"IF(J27=\"\",\"\",VLOOKUP(W23,$A$3:$J$132,10,0))","v":""},null,{"$f":"IFERROR(IF(AA23=\"\",\"\",RANK(AA23,$AA$23:$AA$26)),0)","v":""},null,null,41,{"$f":"IF(G43=\"\",\"\",(VLOOKUP(AE23,$A$3:$J$132,8,0)))","v":""},{"$f":"IF(G43=\"\",\"\",VLOOKUP(AE23,$A$3:$J$132,9,0))","v":""},{"$f":"IF(#REF!=\"\",\"\",VLOOKUP(AE23,$H$3:$J$34,4,0))","v":{"$error":"#REF!"}},null,{"$f":"IFERROR(IF(AI23=\"\",\"\",RANK(AI23,$AI$23:$AI$26)),0)","v":""},null,null,57,{"$f":"IF(#REF!=\"\",\"\",(VLOOKUP(AM23,$A$3:$J$132,8,0)))","v":{"$error":"#REF!"}},{"$f":"IF(#REF!=\"\",\"\",VLOOKUP(AM23,$A$3:$J$132,9,0))","v":{"$error":"#REF!"}},{"$f":"IF(#REF!=\"\",\"\",VLOOKUP(AM23,$A$3:$J$132,10,0))","v":{"$error":"#REF!"}},null,{"$f":"IFERROR(IF(AQ23=\"\",\"\",RANK(AQ23,$AQ$23:$AQ$26)),0)","v":""}]
[22,22,null,null,null,999,null,null,null,null,{"$f":"IF(AB15=\"\",\"\",AB15)","v":""},{"$f":"IF(AA15=\"\",\"\",AA15)","v":""},null,10,null,{"$f":"IF(H12=\"\",\"\",VLOOKUP(N24,$A$3:$J$132,8,0))","v":""},{"$f":"IF(I12=\"\",\"\",VLOOKUP(N24,$A$3:$J$132,9,0))","v":""},{"$f":"IF(J12=\"\",\"\",VLOOKUP(N24,$A$3:$J$132,10,0))","v":""},null,{"$f":"IFERROR(IF(S24=\"\",\"\",RANK(S24,$S$23:$S$26)),0)","v":""},null,null,26,{"$f":"IF(H28=\"\",\"\",(VLOOKUP(W24,$A$3:$J$132,8,0)))","v":""},{"$f":"IF(I28=\"\",\"\",VLOOKUP(W24,$A$3:$J$132,9,0))","v":""},{"$f":"IF(J28=\"\",\"\",VLOOKUP(W24,$A$3:$J$132,10,0))","v":""},null,{"$f":"IFERROR(IF(AA24=\"\",\"\",RANK(AA24,$AA$23:$AA$26)),0)","v":""},null,null,42,{"$f":"IF(G44=\"\",\"\",(VLOOKUP(AE24,$A$3:$J$132,8,0)))","v":""},{"$f":"IF(G44=\"\",\"\",VLOOKUP(AE24,$A$3:$J$132,9,0))","v":""},{"$f":"IF(#REF!=\"\",\"\",VLOOKUP(AE24,$H$3:$J$34,4,0))","v":{"$error":"#REF!"}},null,{"$f":"IFERROR(IF(AI24=\"\",\"\",RANK(AI24,$AI$23:$AI$26)),0)","v":""},null,null,58,{"$f":"IF(#REF!=\"\",\"\",(VLOOKUP(AM24,$A$3:$J$132,8,0)))","v":{"$error":"#REF!"}},{"$f":"IF(#REF!=\"\",\"\",VLOOKUP(AM24,$A$3:$J$132,9,0))","v":{"$error":"#REF!"}},{"$f":"IF(#REF!=\"\",\"\",VLOOKUP(AM24,$A$3:$J$132,10,0))","v":{"$error":"#REF!"}},null,{"$f":"IFERROR(IF(AQ24=\"\",\"\",RANK(AQ24,$AQ$23:$AQ$26)),0)","v":""}]
[23,23,null,null,null,999,null,null,null,null,{"$f":"IF(AB16=\"\",\"\",AB16)","v":""},"",null,11,null,{"$f":"IF(H13=\"\",\"\",VLOOKUP(N25,$A$3:$J$132,8,0))","v":""},{"$f":"IF(I13=\"\",\"\",VLOOKUP(N25,$A$3:$J$132,9,0))","v":""},{"$f":"IF(J13=\"\",\"\",VLOOKUP(N25,$A$3:$J$132,10,0))","v":""},null,{"$f":"IFERROR(IF(S25=\"\",\"\",RANK(S25,$S$23:$S$26)),0)","v":""},null,null,27,{"$f":"IF(H29=\"\",\"\",(VLOOKUP(W25,$A$3:$J$132,8,0)))","v":""},{"$f":"IF(I29=\"\",\"\",VLOOKUP(W25,$A$3:$J$132,9,0))","v":""},{"$f":"IF(J29=\"\",\"\",VLOOKUP(W25,$A$3:$J$132,10,0))","v":""},null,{"$f":"IFERROR(IF(AA25=\"\",\"\",RANK(AA25,$AA$23:$AA$26)),0)","v":""},null,null,43,{"$f":"IF(G45=\"\",\"\",(VLOOKUP(AE25,$A$3:$J$132,8,0)))","v":""},{"$f":"IF(G45=\"\",\"\",VLOOKUP(AE25,$A$3:$J$132,9,0))","v":""},{"$f":"IF(#REF!=\"\",\"\",VLOOKUP(AE25,$H$3:$J$34,4,0))","v":{"$error":"#REF!"}},null,{"$f":"IFERROR(IF(AI25=\"\",\"\",RANK(AI25,$AI$23:$AI$26)),0)","v":""},null,null,59,{"$f":"IF(#REF!=\"\",\"\",(VLOOKUP(AM25,$A$3:$J$132,8,0)))","v":{"$error":"#REF!"}},{"$f":"IF(#REF!=\"\",\"\",VLOOKUP(AM25,$A$3:$J$132,9,0))","v":{"$error":"#REF!"}},{"$f":"IF(#REF!=\"\",\"\",VLOOKUP(AM25,$A$3:$J$132,10,0))","v":{"$error":"#REF!"}},null,{"$f":"IFERROR(IF(AQ25=\"\",\"\",RANK(AQ25,$AQ$23:$AQ$26)),0)","v":""}]
[24,24,null,null,null,999,null,null,null,null,{"$f":"IF(AB17=\"\",\"\",AB17)","v":""},"",null,12,null,{"$f":"IF(H14=\"\",\"\",VLOOKUP(N26,$A$3:$J$132,8,0))","v":""},{"$f":"IF(I14=\"\",\"\",VLOOKUP(N26,$A$3:$J$132,9,0))","v":""},{"$f":"IF(J14=\"\",\"\",VLOOKUP(N26,$A$3:$J$132,10,0))","v":""},null,{"$f":"IFERROR(IF(S26=\"\",\"\",RANK(S26,$S$23:$S$26)),0)","v":""},null,null,28,{"$f":"IF(H30=\"\",\"\",(VLOOKUP(W26,$A$3:$J$132,8,0)))","v":""},{"$f":"IF(I30=\"\",\"\",VLOOKUP(W26,$A$3:$J$132,9,0))","v":""},{"$f":"IF(J30=\"\",\"\",VLOOKUP(W26,$A$3:$J$132,10,0))","v":""},null,{"$f":"IFERROR(IF(AA26=\"\",\"\",RANK(AA26,$AA$23:$AA$26)),0)","v":""},null,null,44,{"$f":"IF(G46=\"\",\"\",(VLOOKUP(AE26,$A$3:$J$132,8,0)))","v":""},{"$f":"IF(G46=\"\",\"\",VLOOKUP(AE26,$A$3:$J$132,9,0))","v":""},{"$f":"IF(#REF!=\"\",\"\",VLOOKUP(AE26,$H$3:$J$34,4,0))","v":{"$error":"#REF!"}},null,{"$f":"IFERROR(IF(AI26=\"\",\"\",RANK(AI26,$AI$23:$AI$26)),0)","v":""},null,null,60,{"$f":"IF(#REF!=\"\",\"\",(VLOOKUP(AM26,$A$3:$J$132,8,0)))","v":{"$error":"#REF!"}},{"$f":"IF(#REF!=\"\",\"\",VLOOKUP(AM26,$A$3:$J$132,9,0))","v":{"$error":"#REF!"}},{"$f":"IF(#REF!=\"\",\"\",VLOOKUP(AM26,$A$3:$J$132,10,0))","v":{"$error":"#REF!"}},null,{"$f":"IFERROR(IF(AQ26=\"\",\"\",RANK(AQ26,$AQ$23:$AQ$26)),0)","v":""}]
[25,25,null,null,null,999,null,null,null,null,{"$f":"IF(AB23=\"\",\"\",AB23)","v":""},{"$f":"IF(AA23=\"\",\"\",AA23)","v":""}]
[26,26,null,null,null,999,null,null,null,null,{"$f":"IF(AB24=\"\",\"\",AB24)","v":""},{"$f":"IF(AA24=\"\",\"\",AA24)","v":""}]
[27,27,null,null,null,999,null,null,null,null,{"$f":"IF(AB25=\"\",\"\",AB25)","v":""},"",null,null,null,"Tisch 4 Runde 3",null,null,null,null,null,null,null,"Tisch 8 Runde 3",null,null,null,null,null,null,null,"Tisch 12 Runde 3"]
[28,28,null,null,null,999,null,null,null,null,{"$f":"IF(AB26=\"\",\"\",AB26)","v":""},""]
[29,29,null,null,null,999,null,null,null,null,{"$f":"IF(AB32=\"\",\"\",AB32)","v":""},{"$f":"IF(AA32=\"\",\"\",AA32)","v":""},null,null,null,"Vorname","Name","Alter","Punkte","Platzierung",null,null,null,"Vorname","Name","Alter","Punkte","Platzierung",null,null,null,"Vorname","Name","Alter","Punkte","Platzierung"]
[30,30,null,null,null,999,null,null,null,null,{"$f":"IF(AB33=\"\",\"\",AB33)","v":""},{"$f":"IF(AA33=\"\",\"\",AA33)","v":""},null,13,null,{"$f":"IF(H15=\"\",\"\",VLOOKUP(N32,$A$3:$J$132,8,0))","v":""},{"$f":"IF(I15=\"\",\"\",VLOOKUP(N32,$A$3:$J$132,9,0))","v":""},{"$f":"IF(I15=\"\",\"\",VLOOKUP(N32,$A$3:$J$132,10,0))","v":""},null,{"$f":"IFERROR(IF(S32=\"\",\"\",RANK(S32,$S$32:$S$35)),0)","v":""},null,null,29,{"$f":"IF(H31=\"\",\"\",(VLOOKUP(W32,$A$3:$J$132,8,0)))","v":""},{"$f":"IF(I31=\"\",\"\",VLOOKUP(W32,$A$3:$J$132,9,0))","v":""},{"$f":"IF(J31=\"\",\"\",VLOOKUP(W32,$A$3:$J$132,10,0))","v":""},null,{"$f":"IFERROR(IF(AA32=\"\",\"\",RANK(AA32,$AA$32:$AA$35)),0)","v":""},null,null,45,{"$f":"IF(G47=\"\",\"\",(VLOOKUP(AE32,$A$3:$J$132,8,0)))","v":""},{"$f":"IF(G47=\"\",\"\",VLOOKUP(AE32,$A$3:$J$132,9,0))","v":""},{"$f":"IF(G47=\"\",\"\",VLOOKUP(AE23,$A$3:$J$132,10,0))","v":""},null,{"$f":"IFERROR(IF(AI32=\"\",\"\",RANK(AI32,$AI$32:$AI$35)),0)","v":""}]
[31,31,null,null,null,999,null,null,null,null,{"$f":"IF(AB34=\"\",\"\",AB34)","v":""},"",null,14,null,{"$f":"IF(H16=\"\",\"\",VLOOKUP(N33,$A$3:$J$132,8,0))","v":""},{"$f":"IF(I16=\"\",\"\",VLOOKUP(N33,$A$3:$J$132,9,0))","v":""},{"$f":"IF(I16=\"\",\"\",VLOOKUP(N33,$A$3:$J$132,10,0))","v":""},null,{"$f":"IFERROR(IF(S33=\"\",\"\",RANK(S33,$S$32:$S$35)),0)","v":""},null,null,30,{"$f":"IF(H32=\"\",\"\",(VLOOKUP(W33,$A$3:$J$132,8,0)))","v":""},{"$f":"IF(I32=\"\",\"\",VLOOKUP(W33,$A$3:$J$132,9,0))","v":""},{"$f":"IF(J32=\"\",\"\",VLOOKUP(W33,$A$3:$J$132,10,0))","v":""},null,{"$f":"IFERROR(IF(AA33=\"\",\"\",RANK(AA33,$AA$32:$AA$35)),0)","v":""},null,null,46,{"$f":"IF(G48=\"\",\"\",(VLOOKUP(AE33,$A$3:$J$132,8,0)))","v":""},{"$f":"IF(G48=\"\",\"\",VLOOKUP(AE33,$A$3:$J$132,9,0))","v":""},{"$f":"IF(G48=\"\",\"\",VLOOKUP(AE24,$A$3:$J$132,10,0))","v":""},null,{"$f":"IFERROR(IF(AI33=\"\",\"\",RANK(AI33,$AI$32:$AI$35)),0)","v":""}]
[32,32,null,null,null,999,null,null,null,null,{"$f":"IF(AB35=\"\",\"\",AB35)","v":""},"",null,15,null,{"$f":"IF(H17=\"\",\"\",VLOOKUP(N34,$A$3:$J$132,8,0))","v":""},{"$f":"IF(I17=\"\",\"\",VLOOKUP(N34,$A$3:$J$132,9,0))","v":""},{"$f":"IF(I17=\"\",\"\",VLOOKUP(N34,$A$3:$J$132,10,0))","v":""},null,{"$f":"IFERROR(IF(S34=\"\",\"\",RANK(S34,$S$32:$S$35)),0)","v":""},null,null,31,{"$f":"IF(H33=\"\",\"\",(VLOOKUP(W34,$A$3:$J$132,8,0)))","v":""},{"$f":"IF(I33=\"\",\"\",VLOOKUP(W34,$A$3:$J$132,9,0))","v":""},{"$f":"IF(J33=\"\",\"\",VLOOKUP(W34,$A$3:$J$132,10,0))","v":""},null,{"$f":"IFERROR(IF(AA34=\"\",\"\",RANK(AA34,$AA$32:$AA$35)),0)","v":""},null,null,47,{"$f":"IF(G49=\"\",\"\",(VLOOKUP(AE34,$A$3:$J$132,8,0)))","v":""},{"$f":"IF(G49=\"\",\"\",VLOOKUP(AE34,$A$3:$J$132,9,0))","v":""},{"$f":"IF(G49=\"\",\"\",VLOOKUP(AE25,$A$3:$J$132,10,0))","v":""},null,{"$f":"IFERROR(IF(AI34=\"\",\"\",RANK(AI34,$AI$32:$AI$35)),0)","v":""}]
[33,33,null,null,null,{"$f":"IF(G35>0,G35,999)","v":999},null,null,null,null,null,null,null,16,null,{"$f":"IF(H18=\"\",\"\",VLOOKUP(N35,$A$3:$J$132,8,0))","v":""},{"$f":"IF(I18=\"\",\"\",VLOOKUP(N35,$A$3:$J$132,9,0))","v":""},{"$f":"IF(I18=\"\",\"\",VLOOKUP(N35,$A$3:$J$132,10,0))","v":""},null,{"$f":"IFERROR(IF(S35=\"\",\"\",RANK(S35,$S$32:$S$35)),0)","v":""},null,null,32,{"$f":"IF(H34=\"\",\"\",(VLOOKUP(W35,$A$3:$J$132,8,0)))","v":""},{"$f":"IF(I34=\"\",\"\",VLOOKUP(W35,$A$3:$J$132,9,0))","v":""},{"$f":"IF(J34=\"\",\"\",VLOOKUP(W35,$A$3:$J$132,10,0))","v":""},null,{"$f":"IFERROR(IF(AA35=\"\",\"\",RANK(AA35,$AA$32:$AA$35)),0)","v":""},null,null,48,{"$f":"IF(G50=\"\",\"\",(VLOOKUP(AE35,$A$3:$J$132,8,0)))","v":""},{"$f":"IF(G50=\"\",\"\",VLOOKUP(AE35,$A$3:$J$132,9,0))","v":""},{"$f":"IF(G50=\"\",\"\",VLOOKUP(AE26,$A$3:$J$132,10,0))","v":""},null,{"$f":"IFERROR(IF(AI35=\"\",\"\",RANK(AI35,$AI$32:$AI$35)),0)","v":""}]
[34,34,null,null,null,999]
[35,35,null,null,null,999]
[36,36,null,null,null,999]
[37,37,null,null,null,999]
[38,38,null,null,null,999,null,null,null,null,null,null,null,null,null,{"$f":"IF(AND(P5>\"\",OR(S5=\"\",S6=\"\",S7=\"\",S8=\"\")),AH1,IF(AND(P14>\"\",OR(S14=\"\",S15=\"\",S16=\"\",S17=\"\")),AH1,IF(AND(P23>\"\",OR(S23=\"\",S24=\"\",S25=\"\",S26=\"\")),AH1,IF(AND(P32>\"\",OR(S32=\"\",S33=\"\",S34=\"\",S35=\"\")),AH1,IF(AND(X5>\"\",OR(AA5=\"\",AA6=\"\",AA7=\"\",AA8=\"\")),AH1,IF(AND(X14>\"\",OR(AA14=\"\",AA15=\"\",AA16=\"\",AA17=\"\")),AH1,IF(AND(X23>\"\",OR(AA23=\"\",AA24=\"\",AA25=\"\",AA26=\"\")),AH1,IF(AND(X32>\"\",OR(AA32=\"\",AA33=\"\",AA34=\"\",AA35=\"\")),AH1,IF(AND(L7<>\"\",H7=\"\"),AH2,IF(AND(L8<>\"\",H8=\"\"),AG1,IF(AND(L9<>\"\",H9=\"\"),AG1,IF(AND(L10<>\"\",H10=\"\"),AG1,AK1))))))))))))","v":"Eingabe o.k."}]
[39,39,null,null,null,999]
[40,40,null,null,null,999]
[41,41,null,null,null,999]
[42,42,null,null,null,999]
[43,43,null,null,null,999]
[44,44,null,null,null,999]
[45,45,null,null,null,999]
[46,46,null,null,null,999]
[47,47,null,null,null,999]
[48,48,null,null,null,999]
[49,49,null,null,null,999]
[50,50,null,null,null,999]
[51,51,null,null,null,999]
[52,52,null,null,null,999]
[53,53,null,null,null,999]
[54,54,null,null,null,999]
[55,55,null,null,null,999]
[56,56,null,null,null,999]
[57,57,null,null,null,999]
[58,58,null,null,null,999]
[59,59,null,null,null,999]
[60,60,null,null,null,999]
[61,61,null,null,null,999]
[62,62,null,null,null,999]
[63,63,null,null,null,999]
[64,64,null,null,null,999]
[65,{"$f":"IF(A67>0,A67,999)","v":65},null,null,null,{"$f":"IF(G67>0,G67,999)","v":999}]
[66,66,null,null,null,999]
[67,67,null,null,null,999]
[68,68,null,null,null,999]
[69,69,null,null,null,999]
[70,70,null,null,null,999]
[71,71,null,null,null,999]
[72,72,null,null,null,999]
[73,73,null,null,null,999]
[74,74,null,null,null,999]
[75,75,null,null,null,999]
[76,76,null,null,null,999]
[77,77,null,null,null,999]
[78,78,null,null,null,999]
[79,79,null,null,null,999]
[80,80,null,null,null,999]
[81,81,null,null,null,999]
[82,82,null,null,null,999]
[83,83,null,null,null,999]
[84,84,null,null,null,999]
[85,85,null,null,null,999]
[86,86,null,null,null,999]
[87,87,null,null,null,999]
[88,88,null,null,null,999]
[89,89,null,null,null,999]
[90,90,null,null,null,999]
[91,91,null,null,null,999]
[92,92,null,null,null,999]
[93,93,null,null,null,999]
[94,94,null,null,null,999]
[95,95,null,null,null,999]
[96,96,null,null,null,999]
[97,97,null,null,null,{"$f":"IF(G99>0,G99,999)","v":999}]
[98,98,null,null,null,999]
[99,99,null,null,null,999]
[100,100,null,null,null,999]
[101,101,null,null,null,999]
[102,102,null,null,null,999]
[103,103,null,null,null,999]
[104,104,null,null,null,999]
[105,105,null,null,null,999]
[106,106,null,null,null,999]
[107,107,null,null,null,999]
[108,108,null,null,null,999]
[109,109,null,null,null,999]
[110,110,null,null,null,999]
[111,111,null,null,null,999]
[112,112,null,null,null,999]
[113,113,null,null,null,999]
[114,114,null,null,null,999]
[115,115,null,null,null,999]
[116,116,null,null,null,999]
[117,117,null,null,null,999]
[118,118,null,null,null,999]
[119,119,null,null,null,999]
[120,120,null,null,null,999]
[121,121,null,null,null,999]
[122,122,null,null,null,999]
[123,123,null,null,null,999]
[124,124,null,null,null,999]
[125,125,null,null,null,999]
[126,126,null,null,null,999]

{"sheet":"Auswertung Runde 3","index":9,"n_rows":13,"n_cols":3,"rows_kept":13,"cut":false,"hidden":true,"merged":[]}
["Vorname","Name","Alter"]
["Test62","62",161]
["Test68","68",167]
["Test27","27",126]
["Test60","60",159]
["Test35","35",134]
["Test15","15",114]
["Test47","47",146]
["Test24","24",123]
["Test3","3",102]
["Test67","67",166]
["Test17","17",116]
["Test16","16",115]

{"sheet":"Teilnehmer 4.Runde","index":10,"n_rows":129,"n_cols":7,"rows_kept":129,"cut":false,"hidden":true,"merged":[]}
[]
[]
[]
[]
[]
[null,null,null,"Nr.:","Vorname","Name","Alter"]
[{"$f":"IF(E7=\"\",\"x\",\"\")","v":""},{"$f":"RAND()","v":0.21418333896429154},null,null,"Test62","62",161]
["",0.96033468674594624,null,null,"Test60","60",159]
["",0.6230851421731971,null,null,"Test24","24",123]
[{"$f":"IF(E10=\"\",\"x\",\"\")","v":""},0.47610307238128269,null,null,"Test47","47",146]
["",0.86445329776977631,{"$f":"RANK(B11,#REF!)","v":{"$error":"#REF!"}},null,"Test17","17",116]
["",0.79617116123556453,null,null,"Test35","35",134]
["",0.44590340422924879,null,null,"Test68","68",167]
["",0.3714878729062735,null,null,"Test27","27",126]
["",0.9327681180060029,{"$f":"RANK(B15,#REF!)","v":{"$error":"#REF!"}},null,"Test67","67",166]
["",0.18319832079481801,null,null,"Test15","15",114]
["",0.80112311986401163,null,null,"Test16","16",115]
["",0.40364734242402267,null,null,"Test3","3",102]
[]
[]
[]
[]
[]
[]
[]
[]
[]
[]
[]
[]
[]
[]
[]
[]
[]
[]
[]
[]
[]
[]
[]
[]
[]
[]
[]
[]
[]
[]
[]
[]
[]
[]
[]
[]
[]
[]
[]
[]
[]
[]
[]
[]
[]
[]
[]
[]
[]
[]
[]
[]
[]
[]
[]
[]
[]
[]
[]
[]
[]
[]
[]
[]
[]
[]
[]
[]
[]
[]
[]
[]
[]
[]
[]
[]
[]
[]
[]
[]
[]
[]
[]
[]
[]
[]
[]
[]
[]
[]
[]
[]
[]
[]
[]
[]
[]
[]
[]
[]
[]
[]
[]
[]
[]
[]
[]
[]
[]
[]
[{"$f":"IF(F129>\"\",B129,IF(G129>\"\",B129,\"\"))","v":""}]

{"sheet":"Runde 4","index":11,"n_rows":128,"n_cols":44,"rows_kept":128,"cut":false,"hidden":false,"merged":[[19,31,20,34],[19,35,20,35],[1,43,2,43],[10,23,11,26],[10,27,11,27],[10,31,11,34],[10,35,11,35],[10,39,11,42],[10,43,11,43],[1,23,2,26],[1,27,2,27],[1,31,2,34],[1,35,2,35],[39,15,41,52],[1,15,2,19],[10,15,11,19],[19,15,20,19],[28,15,29,19],[19,39,20,42],[1,39,2,42],[19,43,20,43],[28,23,29,26],[28,27,29,27],[28,31,29,34],[28,35,29,35],[28,39,29,42],[28,43,29,43],[19,23,20,26],[19,27,20,27]]}
[null,null,null,null,null,null,null,null,null,null,null,null,null,null,null,null,null,null,null,null,null,null,null,null,null,null,null,null,null,null,null,{"$f":"IF(P40=\"Eingabe o.k.\",1,\"\")","v":1},"Es wurden Punkte eingetragen für die kein Spieler zugeordnet ist !!!","Es wurden nicht für jeden Spieler Punkte in dieser Runde eingetragen !!!"]
[null,null,null,null,null,null,null,"Vorname","Name","Alter","Platzierung","Punkte",null,null,null,{"$f":"IF(ISTEXT('Teilnehmer Erfassung'!T2),\"Tisch 1 Rund 4\",IF('Teilnehmer Erfassung'!T2=4,\"Finale\",IF('Teilnehmer Erfassung'!T2=8,\"Halbfinale 1\",\"Tisch 1 Runde 4\")))","v":"Tisch 1 Rund 4"},null,null,null,null,null,null,null,"Tisch 5 Runde 4",null,null,null,null,null,null,null,"Tisch 9 Runde 4",null,null,null,null,null,null,null,"Tisch 13 Runde 4"]
[1,{"$f":"IF(A3>0,A3,999)","v":1},null,null,null,{"$f":"IF(G3>0,G3,999)","v":999},null,null,null,null,{"$f":"IF(T5=\"\",\"\",T5)","v":""},{"$f":"IF(S5=\"\",\"\",S5)","v":""}]
[2,2,null,null,null,{"$f":"IF(G4>0,G4,999)","v":999},null,null,null,null,{"$f":"IF(T6=\"\",\"\",T6)","v":""},{"$f":"IF(S6=\"\",\"\",S6)","v":""},null,null,null,"Vorname","Name","Alter","Punkte","Platzierung",null,null,null,"Vorname","Name","Alter","Punkte","Platzierung",null,null,null,"Vorname","Name","Alter","Punkte","Platzierung",null,null,null,"Vorname","Name","Alter","Punkte","Platzierung"]
[3,3,null,null,null,999,null,null,null,null,{"$f":"IF(T7=\"\",\"\",T7)","v":""},{"$f":"IF(S7=\"\",\"\",S7)","v":""},null,1,null,{"$f":"IF(H3=\"\",\"\",VLOOKUP(N5,$A$3:$J$132,8,0))","v":""},{"$f":"IF(I3=\"\",\"\",VLOOKUP(N5,$A$3:$J$132,9,0))","v":""},{"$f":"IF(J3=\"\",\"\",VLOOKUP(N5,$A$3:$J$132,10,0))","v":""},null,{"$f":"IFERROR(IF(S5=\"\",\"\",RANK(S5,$S$5:$S$8)),0)","v":""},{"$f":"IF(P5=\"\",0,1)","v":0},null,17,{"$f":"IF(#REF!=\"\",\"\",VLOOKUP(W5,$A$3:$J$132,8,0))","v":{"$error":"#REF!"}},{"$f":"IF(#REF!=\"\",\"\",VLOOKUP(W5,$A$3:$J$132,9,0))","v":{"$error":"#REF!"}},{"$f":"IF(#REF!=\"\",\"\",VLOOKUP(W5,$A$3:$J$132,10,0))","v":{"$error":"#REF!"}},null,{"$f":"IFERROR(IF(AA5=\"\",\"\",RANK(AA5,$AA$5:$AA$8)),0)","v":""},null,null,33,{"$f":"IF(G35=\"\",\"\",(VLOOKUP(AE5,$A$3:$J$132,8,0)))","v":""},{"$f":"IF(G35=\"\",\"\",VLOOKUP(AE5,$A$3:$J$132,9,0))","v":""},{"$f":"IF(G35=\"\",\"\",VLOOKUP(AE5,$A$3:$J$132,10,0))","v":""},null,{"$f":"IFERROR(IF(AI5=\"\",\"\",RANK(AI5,$AI$5:$AI$8)),0)","v":""},null,null,49,{"$f":"IF(#REF!=\"\",\"\",(VLOOKUP(AM5,$A$3:$J$322,8,0)))","v":{"$error":"#REF!"}},{"$f":"IF(#REF!=\"\",\"\",VLOOKUP(AM5,$A$3:$J$132,9,0))","v":{"$error":"#REF!"}},{"$f":"IF(#REF!=\"\",\"\",VLOOKUP(AM5,$A$3:$J$132,10,0))","v":{"$error":"#REF!"}},null,{"$f":"IFERROR(IF(AQ5=\"\",\"\",RANK(AQ5,$AQ$5:$AQ$8)),0)","v":""}]
[4,4,null,null,null,999,null,null,null,null,{"$f":"IF(T8=\"\",\"\",T8)","v":""},{"$f":"IF(S8=\"\",\"\",S8)","v":""},null,2,null,{"$f":"IF(H4=\"\",\"\",VLOOKUP(N6,$A$3:$J$132,8,0))","v":""},{"$f":"IF(I4=\"\",\"\",VLOOKUP(N6,$A$3:$J$132,9,0))","v":""},{"$f":"IF(J4=\"\",\"\",VLOOKUP(N6,$A$3:$J$132,10,0))","v":""},null,{"$f":"IFERROR(IF(S6=\"\",\"\",RANK(S6,$S$5:$S$8)),0)","v":""},null,null,18,{"$f":"IF(#REF!=\"\",\"\",VLOOKUP(W6,$A$3:$J$132,8,0))","v":{"$error":"#REF!"}},{"$f":"IF(#REF!=\"\",\"\",VLOOKUP(W6,$A$3:$J$132,9,0))","v":{"$error":"#REF!"}},{"$f":"IF(#REF!=\"\",\"\",VLOOKUP(W6,$A$3:$J$132,10,0))","v":{"$error":"#REF!"}},null,{"$f":"IFERROR(IF(AA6=\"\",\"\",RANK(AA6,$AA$5:$AA$8)),0)","v":""},null,null,34,{"$f":"IF(G36=\"\",\"\",(VLOOKUP(AE6,$A$3:$J$132,8,0)))","v":""},{"$f":"IF(G36=\"\",\"\",VLOOKUP(AE6,$A$3:$J$132,9,0))","v":""},{"$f":"IF(G36=\"\",\"\",VLOOKUP(AE6,$A$3:$J$132,10,0))","v":""},null,{"$f":"IFERROR(IF(AI6=\"\",\"\",RANK(AI6,$AI$5:$AI$8)),0)","v":""},null,null,50,{"$f":"IF(#REF!=\"\",\"\",(VLOOKUP(AM6,$A$3:$J$322,8,0)))","v":{"$error":"#REF!"}},{"$f":"IF(#REF!=\"\",\"\",VLOOKUP(AM6,$A$3:$J$132,9,0))","v":{"$error":"#REF!"}},{"$f":"IF(#REF!=\"\",\"\",VLOOKUP(AM6,$A$3:$J$132,10,0))","v":{"$error":"#REF!"}},null,{"$f":"IFERROR(IF(AQ6=\"\",\"\",RANK(AQ6,$AQ$5:$AQ$8)),0)","v":""}]
[5,5,null,null,null,999,null,null,null,null,{"$f":"IF(T14=\"\",\"\",T14)","v":""},{"$f":"IF(S14=\"\",\"\",S14)","v":""},null,3,null,{"$f":"IF(H5=\"\",\"\",VLOOKUP(N7,$A$3:$J$132,8,0))","v":""},{"$f":"IF(I5=\"\",\"\",VLOOKUP(N7,$A$3:$J$132,9,0))","v":""},{"$f":"IF(J5=\"\",\"\",VLOOKUP(N7,$A$3:$J$132,10,0))","v":""},null,{"$f":"IFERROR(IF(S7=\"\",\"\",RANK(S7,$S$5:$S$8)),0)","v":""},null,null,19,{"$f":"IF(#REF!=\"\",\"\",VLOOKUP(W7,$A$3:$J$132,8,0))","v":{"$error":"#REF!"}},{"$f":"IF(#REF!=\"\",\"\",VLOOKUP(W7,$A$3:$J$132,9,0))","v":{"$error":"#REF!"}},{"$f":"IF(#REF!=\"\",\"\",VLOOKUP(W7,$A$3:$J$132,10,0))","v":{"$error":"#REF!"}},null,{"$f":"IFERROR(IF(AA7=\"\",\"\",RANK(AA7,$AA$5:$AA$8)),0)","v":""},null,null,35,{"$f":"IF(G37=\"\",\"\",(VLOOKUP(AE7,$A$3:$J$132,8,0)))","v":""},{"$f":"IF(G37=\"\",\"\",VLOOKUP(AE7,$A$3:$J$132,9,0))","v":""},{"$f":"IF(G37=\"\",\"\",VLOOKUP(AE7,$A$3:$J$132,10,0))","v":""},null,{"$f":"IFERROR(IF(AI7=\"\",\"\",RANK(AI7,$AI$5:$AI$8)),0)","v":""},null,null,51,{"$f":"IF(#REF!=\"\",\"\",(VLOOKUP(AM7,$A$3:$J$322,8,0)))","v":{"$error":"#REF!"}},{"$f":"IF(#REF!=\"\",\"\",VLOOKUP(AM7,$A$3:$J$132,9,0))","v":{"$error":"#REF!"}},{"$f":"IF(#REF!=\"\",\"\",VLOOKUP(AM7,$A$3:$J$132,10,0))","v":{"$error":"#REF!"}},null,{"$f":"IFERROR(IF(AQ7=\"\",\"\",RANK(AQ7,$AQ$5:$AQ$8)),0)","v":""}]
[6,6,null,null,null,999,null,null,null,null,{"$f":"IF(T15=\"\",\"\",T15)","v":""},{"$f":"IF(S15=\"\",\"\",S15)","v":""},null,4,null,{"$f":"IF(H6=\"\",\"\",VLOOKUP(N8,$A$3:$J$132,8,0))","v":""},{"$f":"IF(I6=\"\",\"\",VLOOKUP(N8,$A$3:$J$132,9,0))","v":""},{"$f":"IF(J6=\"\",\"\",VLOOKUP(N8,$A$3:$J$132,10,0))","v":""},null,{"$f":"IFERROR(IF(S8=\"\",\"\",RANK(S8,$S$5:$S$8)),0)","v":""},null,null,20,{"$f":"IF(#REF!=\"\",\"\",VLOOKUP(W8,$A$3:$J$132,8,0))","v":{"$error":"#REF!"}},{"$f":"IF(#REF!=\"\",\"\",VLOOKUP(W8,$A$3:$J$132,9,0))","v":{"$error":"#REF!"}},{"$f":"IF(#REF!=\"\",\"\",VLOOKUP(W8,$A$3:$J$132,10,0))","v":{"$error":"#REF!"}},null,{"$f":"IFERROR(IF(AA8=\"\",\"\",RANK(AA8,$AA$5:$AA$8)),0)","v":""},null,null,36,{"$f":"IF(G38=\"\",\"\",(VLOOKUP(AE8,$A$3:$J$132,8,0)))","v":""},{"$f":"IF(G38=\"\",\"\",VLOOKUP(AE8,$A$3:$J$132,9,0))","v":""},{"$f":"IF(G38=\"\",\"\",VLOOKUP(AE8,$A$3:$J$132,10,0))","v":""},null,{"$f":"IFERROR(IF(AI8=\"\",\"\",RANK(AI8,$AI$5:$AI$8)),0)","v":""},null,null,52,{"$f":"IF(#REF!=\"\",\"\",(VLOOKUP(AM8,$A$3:$J$322,8,0)))","v":{"$error":"#REF!"}},{"$f":"IF(#REF!=\"\",\"\",VLOOKUP(AM8,$A$3:$J$132,9,0))","v":{"$error":"#REF!"}},{"$f":"IF(#REF!=\"\",\"\",VLOOKUP(AM8,$A$3:$J$132,10,0))","v":{"$error":"#REF!"}},null,{"$f":"IFERROR(IF(AQ8=\"\",\"\",RANK(AQ8,$AQ$5:$AQ$8)),0)","v":""}]
[7,7,null,null,null,999,null,null,null,null,{"$f":"IF(T16=\"\",\"\",T16)","v":""},{"$f":"IF(S16=\"\",\"\",S16)","v":""}]
[8,8,null,null,null,999,null,null,null,null,{"$f":"IF(T17=\"\",\"\",T17)","v":""},{"$f":"IF(S17=\"\",\"\",S17)","v":""}]
[9,9,null,null,null,999,null,null,null,null,{"$f":"IF(T23=\"\",\"\",T23)","v":""},{"$f":"IF(S23=\"\",\"\",S23)","v":""},null,null,null,{"$f":"IF(ISTEXT('Teilnehmer Erfassung'!T2),\"Tisch 1 Rund 4\",IF('Teilnehmer Erfassung'!T2=8,\"Halbfinale 2\",\"Tisch 1 Runde 4\"))","v":"Tisch 1 Rund 4"},null,null,null,null,null,null,null,"Tisch 6 Runde 4",null,null,null,null,null,null,null,"Tisch 10 Runde 4",null,null,null,null,null,null,null,"Tisch 14 Runde 4"]
[10,10,null,null,null,999,null,null,null,null,{"$f":"IF(T24=\"\",\"\",T24)","v":""},{"$f":"IF(S24=\"\",\"\",S24)","v":""}]
[11,11,null,null,null,999,null,null,null,null,{"$f":"IF(T25=\"\",\"\",T25)","v":""},{"$f":"IF(S25=\"\",\"\",S25)","v":""},null,null,null,"Vorname","Name","Alter","Punkte","Platzierung",null,null,null,"Vorname","Name","Alter","Punkte","Platzierung",null,null,null,"Vorname","Name","Alter","Punkte","Platzierung",null,null,null,"Vorname","Name","Alter","Punkte","Platzierung"]
[12,12,null,null,null,999,null,null,null,null,{"$f":"IF(T26=\"\",\"\",T26)","v":""},{"$f":"IF(S26=\"\",\"\",S26)","v":""},null,5,null,{"$f":"IF(H7=\"\",\"\",VLOOKUP(N14,$A$3:$J$132,8,0))","v":""},{"$f":"IF(I7=\"\",\"\",VLOOKUP(N14,$A$3:$J$132,9,0))","v":""},{"$f":"IF(J7=\"\",\"\",VLOOKUP(N14,$A$3:$J$132,10,0))","v":""},null,{"$f":"IFERROR(IF(S14=\"\",\"\",RANK(S14,$S$14:$S$17)),0)","v":""},null,null,21,{"$f":"IF(#REF!=\"\",\"\",(VLOOKUP(W14,$A$3:$J$132,8,0)))","v":{"$error":"#REF!"}},{"$f":"IF(#REF!=\"\",\"\",VLOOKUP(W14,$A$3:$J$132,9,0))","v":{"$error":"#REF!"}},{"$f":"IF(#REF!=\"\",\"\",VLOOKUP(W14,$A$3:$J$132,10,0))","v":{"$error":"#REF!"}},null,{"$f":"IFERROR(IF(AA14=\"\",\"\",RANK(AA14,$AA$14:$AA$17)),0)","v":""},null,null,37,{"$f":"IF(G39=\"\",\"\",(VLOOKUP(AE14,$A$3:$J$132,8,0)))","v":""},{"$f":"IF(G39=\"\",\"\",VLOOKUP(AE14,$A$3:$J$132,9,0))","v":""},{"$f":"IF(G39=\"\",\"\",VLOOKUP(AE14,$A$3:$J$132,10,0))","v":""},null,{"$f":"IFERROR(IF(AI14=\"\",\"\",RANK(AI14,$AI$14:$AI$17)),0)","v":""},null,null,53,{"$f":"IF(#REF!=\"\",\"\",(VLOOKUP(AM14,$A$3:$J$132,8,0)))","v":{"$error":"#REF!"}},{"$f":"IF(#REF!=\"\",\"\",VLOOKUP(AM14,$A$3:$J$132,9,0))","v":{"$error":"#REF!"}},{"$f":"IF(#REF!=\"\",\"\",VLOOKUP(AM14,$A$3:$J$132,10,0))","v":{"$error":"#REF!"}},null,{"$f":"IFERROR(IF(AQ14=\"\",\"\",RANK(AQ14,$AQ$14:$AQ$17)),0)","v":""}]
[13,13,null,null,null,999,null,null,null,null,{"$f":"IF(T32=\"\",\"\",T32)","v":""},{"$f":"IF(S32=\"\",\"\",S32)","v":""},null,6,null,{"$f":"IF(H8=\"\",\"\",VLOOKUP(N15,$A$3:$J$132,8,0))","v":""},{"$f":"IF(I8=\"\",\"\",VLOOKUP(N15,$A$3:$J$132,9,0))","v":""},{"$f":"IF(J8=\"\",\"\",VLOOKUP(N15,$A$3:$J$132,10,0))","v":""},null,{"$f":"IFERROR(IF(S15=\"\",\"\",RANK(S15,$S$14:$S$17)),0)","v":""},null,null,22,{"$f":"IF(#REF!=\"\",\"\",(VLOOKUP(W15,$A$3:$J$132,8,0)))","v":{"$error":"#REF!"}},{"$f":"IF(#REF!=\"\",\"\",VLOOKUP(W15,$A$3:$J$132,9,0))","v":{"$error":"#REF!"}},{"$f":"IF(#REF!=\"\",\"\",VLOOKUP(W15,$A$3:$J$132,10,0))","v":{"$error":"#REF!"}},null,{"$f":"IFERROR(IF(AA15=\"\",\"\",RANK(AA15,$AA$14:$AA$17)),0)","v":""},null,null,38,{"$f":"IF(G40=\"\",\"\",(VLOOKUP(AE15,$A$3:$J$132,8,0)))","v":""},{"$f":"IF(G40=\"\",\"\",VLOOKUP(AE15,$A$3:$J$132,9,0))","v":""},{"$f":"IF(G40=\"\",\"\",VLOOKUP(AE15,$A$3:$J$132,10,0))","v":""},null,{"$f":"IFERROR(IF(AI15=\"\",\"\",RANK(AI15,$AI$14:$AI$17)),0)","v":""},null,null,54,{"$f":"IF(#REF!=\"\",\"\",(VLOOKUP(AM15,$A$3:$J$132,8,0)))","v":{"$error":"#REF!"}},{"$f":"IF(#REF!=\"\",\"\",VLOOKUP(AM15,$A$3:$J$132,9,0))","v":{"$error":"#REF!"}},{"$f":"IF(#REF!=\"\",\"\",VLOOKUP(AM15,$A$3:$J$132,10,0))","v":{"$error":"#REF!"}},null,{"$f":"IFERROR(IF(AQ15=\"\",\"\",RANK(AQ15,$AQ$14:$AQ$17)),0)","v":""}]
[14,14,null,null,null,999,null,null,null,null,{"$f":"IF(T33=\"\",\"\",T33)","v":""},{"$f":"IF(S33=\"\",\"\",S33)","v":""},null,7,null,{"$f":"IF(H9=\"\",\"\",VLOOKUP(N16,$A$3:$J$132,8,0))","v":""},{"$f":"IF(I9=\"\",\"\",VLOOKUP(N16,$A$3:$J$132,9,0))","v":""},{"$f":"IF(J9=\"\",\"\",VLOOKUP(N16,$A$3:$J$132,10,0))","v":""},null,{"$f":"IFERROR(IF(S16=\"\",\"\",RANK(S16,$S$14:$S$17)),0)","v":""},null,null,23,{"$f":"IF(#REF!=\"\",\"\",(VLOOKUP(W16,$A$3:$J$132,8,0)))","v":{"$error":"#REF!"}},{"$f":"IF(#REF!=\"\",\"\",VLOOKUP(W16,$A$3:$J$132,9,0))","v":{"$error":"#REF!"}},{"$f":"IF(#REF!=\"\",\"\",VLOOKUP(W16,$A$3:$J$132,10,0))","v":{"$error":"#REF!"}},null,{"$f":"IFERROR(IF(AA16=\"\",\"\",RANK(AA16,$AA$14:$AA$17)),0)","v":""},null,null,39,{"$f":"IF(G41=\"\",\"\",(VLOOKUP(AE16,$A$3:$J$132,8,0)))","v":""},{"$f":"IF(G41=\"\",\"\",VLOOKUP(AE16,$A$3:$J$132,9,0))","v":""},{"$f":"IF(G41=\"\",\"\",VLOOKUP(AE16,$A$3:$J$132,10,0))","v":""},null,{"$f":"IFERROR(IF(AI16=\"\",\"\",RANK(AI16,$AI$14:$AI$17)),0)","v":""},null,null,55,{"$f":"IF(#REF!=\"\",\"\",(VLOOKUP(AM16,$A$3:$J$132,8,0)))","v":{"$error":"#REF!"}},{"$f":"IF(#REF!=\"\",\"\",VLOOKUP(AM16,$A$3:$J$132,9,0))","v":{"$error":"#REF!"}},{"$f":"IF(#REF!=\"\",\"\",VLOOKUP(AM16,$A$3:$J$132,10,0))","v":{"$error":"#REF!"}},null,{"$f":"IFERROR(IF(AQ16=\"\",\"\",RANK(AQ16,$AQ$14:$AQ$17)),0)","v":""}]
[15,15,null,null,null,999,null,null,null,null,{"$f":"IF(T34=\"\",\"\",T34)","v":""},{"$f":"IF(S34=\"\",\"\",S34)","v":""},null,8,null,{"$f":"IF(H10=\"\",\"\",VLOOKUP(N17,$A$3:$J$132,8,0))","v":""},{"$f":"IF(I10=\"\",\"\",VLOOKUP(N17,$A$3:$J$132,9,0))","v":""},{"$f":"IF(J10=\"\",\"\",VLOOKUP(N17,$A$3:$J$132,10,0))","v":""},null,{"$f":"IFERROR(IF(S17=\"\",\"\",RANK(S17,$S$14:$S$17)),0)","v":""},null,null,24,{"$f":"IF(#REF!=\"\",\"\",(VLOOKUP(W17,$A$3:$J$132,8,0)))","v":{"$error":"#REF!"}},{"$f":"IF(#REF!=\"\",\"\",VLOOKUP(W17,$A$3:$J$132,9,0))","v":{"$error":"#REF!"}},{"$f":"IF(#REF!=\"\",\"\",VLOOKUP(W17,$A$3:$J$132,10,0))","v":{"$error":"#REF!"}},null,{"$f":"IFERROR(IF(AA17=\"\",\"\",RANK(AA17,$AA$14:$AA$17)),0)","v":""},null,null,40,{"$f":"IF(G42=\"\",\"\",(VLOOKUP(AE17,$A$3:$J$132,8,0)))","v":""},{"$f":"IF(G42=\"\",\"\",VLOOKUP(AE17,$A$3:$J$132,9,0))","v":""},{"$f":"IF(G42=\"\",\"\",VLOOKUP(AE17,$A$3:$J$132,10,0))","v":""},null,{"$f":"IFERROR(IF(AI17=\"\",\"\",RANK(AI17,$AI$14:$AI$17)),0)","v":""},null,null,56,{"$f":"IF(#REF!=\"\",\"\",(VLOOKUP(AM17,$A$3:$J$132,8,0)))","v":{"$error":"#REF!"}},{"$f":"IF(#REF!=\"\",\"\",VLOOKUP(AM17,$A$3:$J$132,9,0))","v":{"$error":"#REF!"}},{"$f":"IF(#REF!=\"\",\"\",VLOOKUP(AM17,$A$3:$J$132,10,0))","v":{"$error":"#REF!"}},null,{"$f":"IFERROR(IF(AQ17=\"\",\"\",RANK(AQ17,$AQ$14:$AQ$17)),0)","v":""}]
[16,16,null,null,null,999,null,null,null,null,{"$f":"IF(T35=\"\",\"\",T35)","v":""},{"$f":"IF(S35=\"\",\"\",S35)","v":""}]
[17,17,null,null,null,999]
[18,18,null,null,null,999,null,null,null,null,null,null,null,null,null,"Tisch 3 Runde 4",null,null,null,null,null,null,null,"Tisch 7 Runde 4",null,null,null,null,null,null,null,"Tisch 11 Runde 4",null,null,null,null,null,null,null,"Tisch 15 Runde 4"]
[19,19,null,null,null,999]
[20,20,null,null,null,999,null,null,null,null,null,null,null,null,null,"Vorname","Name","Alter","Punkte","Platzierung",null,null,null,"Vorname","Name","Alter","Punkte","Platzierung",null,null,null,"Vorname","Name","Alter","Punkte","Platzierung",null,null,null,"Vorname","Name","Alter","Punkte","Platzierung"]
[21,21,null,null,null,999,null,null,null,null,null,null,null,9,null,{"$f":"IF(H11=\"\",\"\",VLOOKUP(N23,$A$3:$J$132,8,0))","v":""},{"$f":"IF(I11=\"\",\"\",VLOOKUP(N23,$A$3:$J$132,9,0))","v":""},{"$f":"IF(J11=\"\",\"\",VLOOKUP(N23,$A$3:$J$132,10,0))","v":""},null,{"$f":"IFERROR(IF(S23=\"\",\"\",RANK(S23,$S$23:$S$26)),0)","v":""},null,null,25,{"$f":"IF(#REF!=\"\",\"\",(VLOOKUP(W23,$A$3:$J$132,8,0)))","v":{"$error":"#REF!"}},{"$f":"IF(#REF!=\"\",\"\",VLOOKUP(W23,$A$3:$J$132,9,0))","v":{"$error":"#REF!"}},{"$f":"IF(#REF!=\"\",\"\",VLOOKUP(W23,$A$3:$J$132,10,0))","v":{"$error":"#REF!"}},null,{"$f":"IFERROR(IF(AA23=\"\",\"\",RANK(AA23,$AA$23:$AA$26)),0)","v":""},null,null,41,{"$f":"IF(G43=\"\",\"\",(VLOOKUP(AE23,$A$3:$J$132,8,0)))","v":""},{"$f":"IF(G43=\"\",\"\",VLOOKUP(AE23,$A$3:$J$132,9,0))","v":""},{"$f":"IF(#REF!=\"\",\"\",VLOOKUP(AE23,$H$3:$J$18,4,0))","v":{"$error":"#REF!"}},null,{"$f":"IFERROR(IF(AI23=\"\",\"\",RANK(AI23,$AI$23:$AI$26)),0)","v":""},null,null,57,{"$f":"IF(#REF!=\"\",\"\",(VLOOKUP(AM23,$A$3:$J$132,8,0)))","v":{"$error":"#REF!"}},{"$f":"IF(#REF!=\"\",\"\",VLOOKUP(AM23,$A$3:$J$132,9,0))","v":{"$error":"#REF!"}},{"$f":"IF(#REF!=\"\",\"\",VLOOKUP(AM23,$A$3:$J$132,10,0))","v":{"$error":"#REF!"}},null,{"$f":"IFERROR(IF(AQ23=\"\",\"\",RANK(AQ23,$AQ$23:$AQ$26)),0)","v":""}]
[22,22,null,null,null,999,null,null,null,null,null,null,null,10,null,{"$f":"IF(H12=\"\",\"\",VLOOKUP(N24,$A$3:$J$132,8,0))","v":""},{"$f":"IF(I12=\"\",\"\",VLOOKUP(N24,$A$3:$J$132,9,0))","v":""},{"$f":"IF(J12=\"\",\"\",VLOOKUP(N24,$A$3:$J$132,10,0))","v":""},null,{"$f":"IFERROR(IF(S24=\"\",\"\",RANK(S24,$S$23:$S$26)),0)","v":""},null,null,26,{"$f":"IF(#REF!=\"\",\"\",(VLOOKUP(W24,$A$3:$J$132,8,0)))","v":{"$error":"#REF!"}},{"$f":"IF(#REF!=\"\",\"\",VLOOKUP(W24,$A$3:$J$132,9,0))","v":{"$error":"#REF!"}},{"$f":"IF(#REF!=\"\",\"\",VLOOKUP(W24,$A$3:$J$132,10,0))","v":{"$error":"#REF!"}},null,{"$f":"IFERROR(IF(AA24=\"\",\"\",RANK(AA24,$AA$23:$AA$26)),0)","v":""},null,null,42,{"$f":"IF(G44=\"\",\"\",(VLOOKUP(AE24,$A$3:$J$132,8,0)))","v":""},{"$f":"IF(G44=\"\",\"\",VLOOKUP(AE24,$A$3:$J$132,9,0))","v":""},{"$f":"IF(#REF!=\"\",\"\",VLOOKUP(AE24,$H$3:$J$18,4,0))","v":{"$error":"#REF!"}},null,{"$f":"IFERROR(IF(AI24=\"\",\"\",RANK(AI24,$AI$23:$AI$26)),0)","v":""},null,null,58,{"$f":"IF(#REF!=\"\",\"\",(VLOOKUP(AM24,$A$3:$J$132,8,0)))","v":{"$error":"#REF!"}},{"$f":"IF(#REF!=\"\",\"\",VLOOKUP(AM24,$A$3:$J$132,9,0))","v":{"$error":"#REF!"}},{"$f":"IF(#REF!=\"\",\"\",VLOOKUP(AM24,$A$3:$J$132,10,0))","v":{"$error":"#REF!"}},null,{"$f":"IFERROR(IF(AQ24=\"\",\"\",RANK(AQ24,$AQ$23:$AQ$26)),0)","v":""}]
[23,23,null,null,null,999,null,null,null,null,null,null,null,11,null,{"$f":"IF(H13=\"\",\"\",VLOOKUP(N25,$A$3:$J$132,8,0))","v":""},{"$f":"IF(I13=\"\",\"\",VLOOKUP(N25,$A$3:$J$132,9,0))","v":""},{"$f":"IF(J13=\"\",\"\",VLOOKUP(N25,$A$3:$J$132,10,0))","v":""},null,{"$f":"IFERROR(IF(S25=\"\",\"\",RANK(S25,$S$23:$S$26)),0)","v":""},null,null,27,{"$f":"IF(#REF!=\"\",\"\",(VLOOKUP(W25,$A$3:$J$132,8,0)))","v":{"$error":"#REF!"}},{"$f":"IF(#REF!=\"\",\"\",VLOOKUP(W25,$A$3:$J$132,9,0))","v":{"$error":"#REF!"}},{"$f":"IF(#REF!=\"\",\"\",VLOOKUP(W25,$A$3:$J$132,10,0))","v":{"$error":"#REF!"}},null,{"$f":"IFERROR(IF(AA25=\"\",\"\",RANK(AA25,$AA$23:$AA$26)),0)","v":""},null,null,43,{"$f":"IF(G45=\"\",\"\",(VLOOKUP(AE25,$A$3:$J$132,8,0)))","v":""},{"$f":"IF(G45=\"\",\"\",VLOOKUP(AE25,$A$3:$J$132,9,0))","v":""},{"$f":"IF(#REF!=\"\",\"\",VLOOKUP(AE25,$H$3:$J$18,4,0))","v":{"$error":"#REF!"}},null,{"$f":"IFERROR(IF(AI25=\"\",\"\",RANK(AI25,$AI$23:$AI$26)),0)","v":""},null,null,59,{"$f":"IF(#REF!=\"\",\"\",(VLOOKUP(AM25,$A$3:$J$132,8,0)))","v":{"$error":"#REF!"}},{"$f":"IF(#REF!=\"\",\"\",VLOOKUP(AM25,$A$3:$J$132,9,0))","v":{"$error":"#REF!"}},{"$f":"IF(#REF!=\"\",\"\",VLOOKUP(AM25,$A$3:$J$132,10,0))","v":{"$error":"#REF!"}},null,{"$f":"IFERROR(IF(AQ25=\"\",\"\",RANK(AQ25,$AQ$23:$AQ$26)),0)","v":""}]
[24,24,null,null,null,999,null,null,null,null,null,null,null,12,null,{"$f":"IF(H14=\"\",\"\",VLOOKUP(N26,$A$3:$J$132,8,0))","v":""},{"$f":"IF(I14=\"\",\"\",VLOOKUP(N26,$A$3:$J$132,9,0))","v":""},{"$f":"IF(J14=\"\",\"\",VLOOKUP(N26,$A$3:$J$132,10,0))","v":""},null,{"$f":"IFERROR(IF(S26=\"\",\"\",RANK(S26,$S$23:$S$26)),0)","v":""},null,null,28,{"$f":"IF(#REF!=\"\",\"\",(VLOOKUP(W26,$A$3:$J$132,8,0)))","v":{"$error":"#REF!"}},{"$f":"IF(#REF!=\"\",\"\",VLOOKUP(W26,$A$3:$J$132,9,0))","v":{"$error":"#REF!"}},{"$f":"IF(#REF!=\"\",\"\",VLOOKUP(W26,$A$3:$J$132,10,0))","v":{"$error":"#REF!"}},null,{"$f":"IFERROR(IF(AA26=\"\",\"\",RANK(AA26,$AA$23:$AA$26)),0)","v":""},null,null,44,{"$f":"IF(G46=\"\",\"\",(VLOOKUP(AE26,$A$3:$J$132,8,0)))","v":""},{"$f":"IF(G46=\"\",\"\",VLOOKUP(AE26,$A$3:$J$132,9,0))","v":""},{"$f":"IF(#REF!=\"\",\"\",VLOOKUP(AE26,$H$3:$J$18,4,0))","v":{"$error":"#REF!"}},null,{"$f":"IFERROR(IF(AI26=\"\",\"\",RANK(AI26,$AI$23:$AI$26)),0)","v":""},null,null,60,{"$f":"IF(#REF!=\"\",\"\",(VLOOKUP(AM26,$A$3:$J$132,8,0)))","v":{"$error":"#REF!"}},{"$f":"IF(#REF!=\"\",\"\",VLOOKUP(AM26,$A$3:$J$132,9,0))","v":{"$error":"#REF!"}},{"$f":"IF(#REF!=\"\",\"\",VLOOKUP(AM26,$A$3:$J$132,10,0))","v":{"$error":"#REF!"}},null,{"$f":"IFERROR(IF(AQ26=\"\",\"\",RANK(AQ26,$AQ$23:$AQ$26)),0)","v":""}]
[25,25,null,null,null,999]
[26,26,null,null,null,999]
[27,27,null,null,null,999,null,null,null,null,null,null,null,null,null,"Tisch 4 Runde 4",null,null,null,null,null,null,null,"Tisch 8 Runde 4",null,null,null,null,null,null,null,"Tisch 12 Runde 4"]
[28,28,null,null,null,999]
[29,29,null,null,null,999,null,null,null,null,null,null,null,null,null,"Vorname","Name","Alter","Punkte","Platzierung",null,null,null,"Vorname","Name","Alter","Punkte","Platzierung",null,null,null,"Vorname","Name","Alter","Punkte","Platzierung"]
[30,30,null,null,null,999,null,null,null,null,null,null,null,13,null,{"$f":"IF(H15=\"\",\"\",VLOOKUP(N32,$A$3:$J$132,8,0))","v":""},{"$f":"IF(I15=\"\",\"\",VLOOKUP(N32,$A$3:$J$132,9,0))","v":""},{"$f":"IF(I15=\"\",\"\",VLOOKUP(N32,$A$3:$J$132,10,0))","v":""},null,{"$f":"IFERROR(IF(S32=\"\",\"\",RANK(S32,$S$32:$S$35)),0)","v":""},null,null,29,{"$f":"IF(#REF!=\"\",\"\",(VLOOKUP(W32,$A$3:$J$132,8,0)))","v":{"$error":"#REF!"}},{"$f":"IF(#REF!=\"\",\"\",VLOOKUP(W32,$A$3:$J$132,9,0))","v":{"$error":"#REF!"}},{"$f":"IF(#REF!=\"\",\"\",VLOOKUP(W32,$A$3:$J$132,10,0))","v":{"$error":"#REF!"}},null,{"$f":"IFERROR(IF(AA32=\"\",\"\",RANK(AA32,$AA$32:$AA$35)),0)","v":""},null,null,45,{"$f":"IF(G47=\"\",\"\",(VLOOKUP(AE32,$A$3:$J$132,8,0)))","v":""},{"$f":"IF(G47=\"\",\"\",VLOOKUP(AE32,$A$3:$J$132,9,0))","v":""},{"$f":"IF(G47=\"\",\"\",VLOOKUP(AE23,$A$3:$J$132,10,0))","v":""},null,{"$f":"IFERROR(IF(AI32=\"\",\"\",RANK(AI32,$AI$32:$AI$35)),0)","v":""}]
[31,31,null,null,null,999,null,null,null,null,null,null,null,14,null,{"$f":"IF(H16=\"\",\"\",VLOOKUP(N33,$A$3:$J$132,8,0))","v":""},{"$f":"IF(I16=\"\",\"\",VLOOKUP(N33,$A$3:$J$132,9,0))","v":""},{"$f":"IF(I16=\"\",\"\",VLOOKUP(N33,$A$3:$J$132,10,0))","v":""},null,{"$f":"IFERROR(IF(S33=\"\",\"\",RANK(S33,$S$32:$S$35)),0)","v":""},null,null,30,{"$f":"IF(#REF!=\"\",\"\",(VLOOKUP(W33,$A$3:$J$132,8,0)))","v":{"$error":"#REF!"}},{"$f":"IF(#REF!=\"\",\"\",VLOOKUP(W33,$A$3:$J$132,9,0))","v":{"$error":"#REF!"}},{"$f":"IF(#REF!=\"\",\"\",VLOOKUP(W33,$A$3:$J$132,10,0))","v":{"$error":"#REF!"}},null,{"$f":"IFERROR(IF(AA33=\"\",\"\",RANK(AA33,$AA$32:$AA$35)),0)","v":""},null,null,46,{"$f":"IF(G48=\"\",\"\",(VLOOKUP(AE33,$A$3:$J$132,8,0)))","v":""},{"$f":"IF(G48=\"\",\"\",VLOOKUP(AE33,$A$3:$J$132,9,0))","v":""},{"$f":"IF(G48=\"\",\"\",VLOOKUP(AE24,$A$3:$J$132,10,0))","v":""},null,{"$f":"IFERROR(IF(AI33=\"\",\"\",RANK(AI33,$AI$32:$AI$35)),0)","v":""}]
[32,32,null,null,null,999,null,null,null,null,null,null,null,15,null,{"$f":"IF(H17=\"\",\"\",VLOOKUP(N34,$A$3:$J$132,8,0))","v":""},{"$f":"IF(I17=\"\",\"\",VLOOKUP(N34,$A$3:$J$132,9,0))","v":""},{"$f":"IF(I17=\"\",\"\",VLOOKUP(N34,$A$3:$J$132,10,0))","v":""},null,{"$f":"IFERROR(IF(S34=\"\",\"\",RANK(S34,$S$32:$S$35)),0)","v":""},null,null,31,{"$f":"IF(#REF!=\"\",\"\",(VLOOKUP(W34,$A$3:$J$132,8,0)))","v":{"$error":"#REF!"}},{"$f":"IF(#REF!=\"\",\"\",VLOOKUP(W34,$A$3:$J$132,9,0))","v":{"$error":"#REF!"}},{"$f":"IF(#REF!=\"\",\"\",VLOOKUP(W34,$A$3:$J$132,10,0))","v":{"$error":"#REF!"}},null,{"$f":"IFERROR(IF(AA34=\"\",\"\",RANK(AA34,$AA$32:$AA$35)),0)","v":""},null,null,47,{"$f":"IF(G49=\"\",\"\",(VLOOKUP(AE34,$A$3:$J$132,8,0)))","v":""},{"$f":"IF(G49=\"\",\"\",VLOOKUP(AE34,$A$3:$J$132,9,0))","v":""},{"$f":"IF(G49=\"\",\"\",VLOOKUP(AE25,$A$3:$J$132,10,0))","v":""},null,{"$f":"IFERROR(IF(AI34=\"\",\"\",RANK(AI34,$AI$32:$AI$35)),0)","v":""}]
[33,33,null,null,null,999,null,null,null,null,null,null,null,16,null,{"$f":"IF(H18=\"\",\"\",VLOOKUP(N35,$A$3:$J$132,8,0))","v":""},{"$f":"IF(I18=\"\",\"\",VLOOKUP(N35,$A$3:$J$132,9,0))","v":""},{"$f":"IF(I18=\"\",\"\",VLOOKUP(N35,$A$3:$J$132,10,0))","v":""},null,{"$f":"IFERROR(IF(S35=\"\",\"\",RANK(S35,$S$32:$S$35)),0)","v":""},null,null,32,{"$f":"IF(#REF!=\"\",\"\",(VLOOKUP(W35,$A$3:$J$132,8,0)))","v":{"$error":"#REF!"}},{"$f":"IF(#REF!=\"\",\"\",VLOOKUP(W35,$A$3:$J$132,9,0))","v":{"$error":"#REF!"}},{"$f":"IF(#REF!=\"\",\"\",VLOOKUP(W35,$A$3:$J$132,10,0))","v":{"$error":"#REF!"}},null,{"$f":"IFERROR(IF(AA35=\"\",\"\",RANK(AA35,$AA$32:$AA$35)),0)","v":""},null,null,48,{"$f":"IF(G50=\"\",\"\",(VLOOKUP(AE35,$A$3:$J$132,8,0)))","v":""},{"$f":"IF(G50=\"\",\"\",VLOOKUP(AE35,$A$3:$J$132,9,0))","v":""},{"$f":"IF(G50=\"\",\"\",VLOOKUP(AE26,$A$3:$J$132,10,0))","v":""},null,{"$f":"IFERROR(IF(AI35=\"\",\"\",RANK(AI35,$AI$32:$AI$35)),0)","v":""}]
[34,34,null,null,null,999]
[35,35,null,null,null,999]
[36,36,null,null,null,999]
[37,37,null,null,null,999]
[38,38,null,null,null,999,null,null,null,null,null,null,null,null,null,{"$f":"IF(AND(P5>\"\",OR(S5=\"\",S6=\"\",S7=\"\",S8=\"\")),AH1,IF(AND(P14>\"\",OR(S14=\"\",S15=\"\",S16=\"\",S17=\"\")),AH1,IF(AND(P23>\"\",OR(S23=\"\",S24=\"\",S25=\"\",S26=\"\")),AH1,IF(AND(P32>\"\",OR(S32=\"\",S33=\"\",S34=\"\",S35=\"\")),AH1,IF(AND(L7<>\"\",H7=\"\"),AG1,IF(AND(L8<>\"\",H8=\"\"),AG1,IF(AND(L9<>\"\",H9=\"\"),AG1,IF(AND(L10<>\"\",H10=\"\"),AG1,IF(AND(L11<>\"\",H11=\"\"),AG1,IF(AND(L12<>\"\",H12=\"\"),AG1,IF(AND(L13<>\"\",H13=\"\"),AG1,IF(AND(L14<>\"\",H14=\"\"),AG1,IF(AND(PL15<>\"\",H15=\"\"),AG1,IF(AND(L16<>\"\",H16=\"\"),AG1,IF(AND(L17<>\"\",H17=\"\"),AG1,IF(AND(L18<>\"\",H18=\"\"),AG1,\"Eingabe o.k.\"))))))))))))))))","v":"Eingabe o.k."}]
[39,39,null,null,null,999]
[40,40,null,null,null,999]
[41,41,null,null,null,999]
[42,42,null,null,null,999]
[43,43,null,null,null,999]
[44,44,null,null,null,999]
[45,45,null,null,null,999]
[46,46,null,null,null,999]
[47,47,null,null,null,999]
[48,48,null,null,null,999]
[49,49,null,null,null,999]
[50,50,null,null,null,999]
[51,51,null,null,null,999]
[52,52,null,null,null,999]
[53,53,null,null,null,999]
[54,54,null,null,null,999]
[55,55,null,null,null,999]
[56,56,null,null,null,999]
[57,57,null,null,null,999]
[58,58,null,null,null,999]
[59,59,null,null,null,999]
[60,60,null,null,null,999]
[61,61,null,null,null,999]
[62,62,null,null,null,999]
[63,63,null,null,null,999]
[64,64,null,null,null,999]
[65,{"$f":"IF(A67>0,A67,999)","v":65},null,null,null,999]
[66,66,null,null,null,{"$f":"IF(G68>0,G68,999)","v":999}]
[67,67,null,null,null,999]
[68,68,null,null,null,999]
[69,69,null,null,null,999]
[70,70,null,null,null,999]
[71,71,null,null,null,999]
[72,72,null,null,null,999]
[73,73,null,null,null,999]
[74,74,null,null,null,999]
[75,75,null,null,null,999]
[76,76,null,null,null,999]
[77,77,null,null,null,999]
[78,78,null,null,null,999]
[79,79,null,null,null,999]
[80,80,null,null,null,999]
[81,81,null,null,null,999]
[82,82,null,null,null,999]
[83,83,null,null,null,999]
[84,84,null,null,null,999]
[85,85,null,null,null,999]
[86,86,null,null,null,999]
[87,87,null,null,null,999]
[88,88,null,null,null,999]
[89,89,null,null,null,999]
[90,90,null,null,null,999]
[91,91,null,null,null,999]
[92,92,null,null,null,999]
[93,93,null,null,null,999]
[94,94,null,null,null,999]
[95,95,null,null,null,999]
[96,96,null,null,null,999]
[97,97,null,null,null,999]
[98,98,null,null,null,999]
[99,99,null,null,null,999]
[100,100,null,null,null,999]
[101,101,null,null,null,999]
[102,102,null,null,null,999]
[103,103,null,null,null,999]
[104,104,null,null,null,999]
[105,105,null,null,null,999]
[106,106,null,null,null,999]
[107,107,null,null,null,999]
[108,108,null,null,null,999]
[109,109,null,null,null,999]
[110,110,null,null,null,999]
[111,111,null,null,null,999]
[112,112,null,null,null,999]
[113,113,null,null,null,999]
[114,114,null,null,null,999]
[115,115,null,null,null,999]
[116,116,null,null,null,999]
[117,117,null,null,null,999]
[118,118,null,null,null,999]
[119,119,null,null,null,999]
[120,120,null,null,null,999]
[121,121,null,null,null,999]
[122,122,null,null,null,999]
[123,123,null,null,null,999]
[124,124,null,null,null,999]
[125,125,null,null,null,999]
[126,126,null,null,null,999]

{"sheet":"Auswertung Runde 4","index":12,"n_rows":9,"n_cols":3,"rows_kept":9,"cut":false,"hidden":true,"merged":[]}
["Vorname","Name","Alter"]
["Test67","67",166]
["Test47","47",146]
["Test17","17",116]
["Test15","15",114]
["Test24","24",123]
["Test35","35",134]
["Test16","16",115]
["Test60","60",159]

{"sheet":"Teilnehmer 5.Runde","index":13,"n_rows":129,"n_cols":7,"rows_kept":129,"cut":false,"hidden":true,"merged":[]}
[]
[]
[]
[]
[]
[null,null,null,"Nr.:","Vorname","Name","Alter"]
[{"$f":"IF(E7=\"\",\"x\",\"\")","v":""},{"$f":"RAND()","v":0.32734424642116056},null,null,"Test35","35",134]
["",0.46814074433760999,{"$f":"RANK(B8,$B$7:$B$7)","v":{"$error":"#N/A"}},null,"Test67","67",166]
["",0.93478090360594501,{"$error":"#N/A"},null,"Test17","17",116]
[{"$f":"IF(E10=\"\",\"x\",\"\")","v":""},0.2720516719594076,{"$error":"#N/A"},null,"Test24","24",123]
["",0.50146550493756759,{"$error":"#N/A"},null,"Test15","15",114]
["",0.78643230826196264,{"$error":"#N/A"},null,"Test60","60",159]
["",0.8630881199166569,{"$error":"#N/A"},null,"Test47","47",146]
["",0.41143796781418496,null,null,"Test16","16",115]
[]
[]
[]
[]
[]
[]
[]
[]
[]
[]
[]
[]
[]
[]
[]
[]
[]
[]
[]
[]
[]
[]
[]
[]
[]
[]
[]
[]
[]
[]
[]
[]
[]
[]
[]
[]
[]
[]
[]
[]
[]
[]
[]
[]
[]
[]
[]
[]
[]
[]
[]
[]
[]
[]
[]
[]
[]
[]
[]
[]
[]
[]
[]
[]
[]
[]
[]
[]
[]
[]
[]
[]
[]
[]
[]
[]
[]
[]
[]
[]
[]
[]
[]
[]
[]
[]
[]
[]
[]
[]
[]
[]
[]
[]
[]
[]
[]
[]
[]
[]
[]
[]
[]
[]
[]
[]
[]
[]
[]
[]
[]
[]
[]
[]
[{"$f":"IF(F129>\"\",B129,IF(G129>\"\",B129,\"\"))","v":""}]

{"sheet":"Runde 5","index":14,"n_rows":128,"n_cols":34,"rows_kept":128,"cut":false,"hidden":false,"merged":[[19,43,20,43],[28,23,29,26],[28,27,29,27],[28,31,29,34],[28,35,29,35],[28,39,29,42],[28,43,29,43],[19,23,20,26],[19,27,20,27],[19,31,20,34],[19,35,20,35],[1,15,2,19],[10,15,11,19],[39,15,41,66],[1,39,2,42],[1,43,2,43],[10,23,11,26],[10,27,11,27],[10,31,11,34],[10,35,11,35],[10,39,11,42],[10,43,11,43],[1,23,2,26],[1,27,2,27],[1,31,2,34],[1,35,2,35],[19,39,20,42]]}
[null,null,null,null,null,null,null,null,null,null,null,null,null,null,null,null,null,null,null,null,{"$f":"IF(P40=\"Eingabe o.k.\",1,\"\")","v":1},null,null,null,null,null,null,null,null,null,null,{"$f":"IF(#REF!=\"Eingabe o.k.\",1,\"\")","v":{"$error":"#REF!"}},"Es wurden Punkte eingetragen für die kein Spieler zugeordnet ist !!!","Es wurden nicht für jeden Spieler Punkte in dieser Runde eingetragen !!!"]
[null,null,null,null,null,null,null,"Vorname","Name","Alter","Platzierung","Punkte",null,null,null,{"$f":"IF(ISTEXT('Teilnehmer Erfassung'!W2),\"Tisch 1 Rund 5\",IF('Teilnehmer Erfassung'!W2=4,\"Finale\",IF('Teilnehmer Erfassung'!W2=8,\"Halbfinale 1\",\"Tisch 1 Runde 5\")))","v":"Tisch 1 Rund 5"}]
[1,{"$f":"IF(A3>0,A3,999)","v":1},null,null,null,{"$f":"IF(G3>0,G3,999)","v":999},null,null,null,null,{"$f":"IF(T5=\"\",\"\",T5)","v":""},{"$f":"IF(S5=\"\",\"\",S5)","v":""}]
[2,2,null,null,null,999,null,null,null,null,{"$f":"IF(T6=\"\",\"\",T6)","v":""},{"$f":"IF(S6=\"\",\"\",S6)","v":""},null,null,null,"Vorname","Name","Alter","Punkte","Platzierung"]
[3,3,null,null,null,999,null,null,null,null,{"$f":"IF(T7=\"\",\"\",T7)","v":""},{"$f":"IF(S7=\"\",\"\",S7)","v":""},null,1,null,{"$f":"IF(H3=\"\",\"\",VLOOKUP(N5,$A$3:$J$132,8,0))","v":""},{"$f":"IF(I3=\"\",\"\",VLOOKUP(N5,$A$3:$J$132,9,0))","v":""},{"$f":"IF(J3=\"\",\"\",VLOOKUP(N5,$A$3:$J$132,10,0))","v":""},null,{"$f":"IFERROR(IF(S5=\"\",\"\",RANK(S5,$S$5:$S$8)),0)","v":""},{"$f":"IF(P5=\"\",0,1)","v":0},null,17]
[4,4,null,null,null,999,null,null,null,null,{"$f":"IF(T8=\"\",\"\",T8)","v":""},{"$f":"IF(S8=\"\",\"\",S8)","v":""},null,2,null,{"$f":"IF(H4=\"\",\"\",VLOOKUP(N6,$A$3:$J$132,8,0))","v":""},{"$f":"IF(I4=\"\",\"\",VLOOKUP(N6,$A$3:$J$132,9,0))","v":""},{"$f":"IF(J4=\"\",\"\",VLOOKUP(N6,$A$3:$J$132,10,0))","v":""},null,{"$f":"IFERROR(IF(S6=\"\",\"\",RANK(S6,$S$5:$S$8)),0)","v":""},null,null,18]
[5,5,null,null,null,999,null,null,null,null,{"$f":"IF(T14=\"\",\"\",T14)","v":""},{"$f":"IF(S14=\"\",\"\",S14)","v":""},null,3,null,{"$f":"IF(H5=\"\",\"\",VLOOKUP(N7,$A$3:$J$132,8,0))","v":""},{"$f":"IF(I5=\"\",\"\",VLOOKUP(N7,$A$3:$J$132,9,0))","v":""},{"$f":"IF(J5=\"\",\"\",VLOOKUP(N7,$A$3:$J$132,10,0))","v":""},null,{"$f":"IFERROR(IF(S7=\"\",\"\",RANK(S7,$S$5:$S$8)),0)","v":""},null,null,19]
[6,6,null,null,null,999,null,null,null,null,{"$f":"IF(T15=\"\",\"\",T15)","v":""},{"$f":"IF(S15=\"\",\"\",S15)","v":""},null,4,null,{"$f":"IF(H6=\"\",\"\",VLOOKUP(N8,$A$3:$J$132,8,0))","v":""},{"$f":"IF(I6=\"\",\"\",VLOOKUP(N8,$A$3:$J$132,9,0))","v":""},{"$f":"IF(J6=\"\",\"\",VLOOKUP(N8,$A$3:$J$132,10,0))","v":""},null,{"$f":"IFERROR(IF(S8=\"\",\"\",RANK(S8,$S$5:$S$8)),0)","v":""},null,null,20]
[7,7,null,null,null,999,null,null,null,null,{"$f":"IF(T16=\"\",\"\",T16)","v":""},{"$f":"IF(S16=\"\",\"\",S16)","v":""}]
[8,8,null,null,null,999,null,null,null,null,{"$f":"IF(T17=\"\",\"\",T17)","v":""},{"$f":"IF(S17=\"\",\"\",S17)","v":""}]
[9,9,null,null,null,999,null,null,null,null,null,null,null,null,null,{"$f":"IF(ISTEXT('Teilnehmer Erfassung'!W2),\"Tisch 1 Rund 5\",IF('Teilnehmer Erfassung'!W2=8,\"Halbfinale2\",\"Tisch 1 Runde 5\"))","v":"Tisch 1 Rund 5"}]
[10,10,null,null,null,999]
[11,11,null,null,null,999,null,null,null,null,null,null,null,null,null,"Vorname","Name","Alter","Punkte","Platzierung"]
[12,12,null,null,null,999,null,null,null,null,null,null,null,5,null,{"$f":"IF(H7=\"\",\"\",VLOOKUP(N14,$A$3:$J$132,8,0))","v":""},{"$f":"IF(I7=\"\",\"\",VLOOKUP(N14,$A$3:$J$132,9,0))","v":""},{"$f":"IF(J7=\"\",\"\",VLOOKUP(N14,$A$3:$J$132,10,0))","v":""},null,{"$f":"IFERROR(IF(S14=\"\",\"\",RANK(S14,$S$14:$S$17)),0)","v":""},null,null,21]
[13,13,null,null,null,999,null,null,null,null,null,null,null,6,null,{"$f":"IF(H8=\"\",\"\",VLOOKUP(N15,$A$3:$J$132,8,0))","v":""},{"$f":"IF(I8=\"\",\"\",VLOOKUP(N15,$A$3:$J$132,9,0))","v":""},{"$f":"IF(J8=\"\",\"\",VLOOKUP(N15,$A$3:$J$132,10,0))","v":""},null,{"$f":"IFERROR(IF(S15=\"\",\"\",RANK(S15,$S$14:$S$17)),0)","v":""},null,null,22]
[14,14,null,null,null,999,null,null,null,null,null,null,null,7,null,{"$f":"IF(H9=\"\",\"\",VLOOKUP(N16,$A$3:$J$132,8,0))","v":""},{"$f":"IF(I9=\"\",\"\",VLOOKUP(N16,$A$3:$J$132,9,0))","v":""},{"$f":"IF(J9=\"\",\"\",VLOOKUP(N16,$A$3:$J$132,10,0))","v":""},null,{"$f":"IFERROR(IF(S16=\"\",\"\",RANK(S16,$S$14:$S$17)),0)","v":""},null,null,23]
[15,15,null,null,null,999,null,null,null,null,null,null,null,8,null,{"$f":"IF(H10=\"\",\"\",VLOOKUP(N17,$A$3:$J$132,8,0))","v":""},{"$f":"IF(I10=\"\",\"\",VLOOKUP(N17,$A$3:$J$132,9,0))","v":""},{"$f":"IF(J10=\"\",\"\",VLOOKUP(N17,$A$3:$J$132,10,0))","v":""},null,{"$f":"IFERROR(IF(S17=\"\",\"\",RANK(S17,$S$14:$S$17)),0)","v":""},null,null,24]
[16,16,null,null,null,999]
[17,17,null,null,null,999]
[18,18,null,null,null,999]
[19,19,null,null,null,999]
[20,20,null,null,null,999]
[21,21,null,null,null,999,null,null,null,null,null,null,null,9]
[22,22,null,null,null,999,null,null,null,null,null,null,null,10]
[23,23,null,null,null,999,null,null,null,null,null,null,null,11,null,null,null,null,null,null,null,null,27]
[24,24,null,null,null,999,null,null,null,null,null,null,null,12,null,null,null,null,null,null,null,null,28]
[25,25,null,null,null,999]
[26,26,null,null,null,999]
[27,27,null,null,null,999]
[28,28,null,null,null,999]
[29,29,null,null,null,999]
[30,30,null,null,null,999,null,null,null,null,null,null,null,13,null,null,null,null,null,null,null,null,29]
[31,31,null,null,null,999,null,null,null,null,null,null,null,14,null,null,null,null,null,null,null,null,30]
[32,32,null,null,null,999,null,null,null,null,null,null,null,15,null,null,null,null,null,null,null,null,31]
[33,33,null,null,null,{"$f":"IF(G35>0,G35,999)","v":999},null,null,null,null,null,null,null,16,null,null,null,null,null,null,null,null,32]
[34,34,null,null,null,999]
[35,35,null,null,null,999]
[36,36,null,null,null,999]
[37,37,null,null,null,999]
[38,38,null,null,null,999,null,null,null,null,null,null,null,null,null,{"$f":"IF(AND(P5>\"\",OR(S5=\"\",S6=\"\",S7=\"\",S8=\"\")),AH1,IF(AND(P14>\"\",OR(S14=\"\",S15=\"\",S16=\"\",S17=\"\")),AH1,IF(AND(L7<>\"\",H7=\"\"),AG1,IF(AND(L8<>\"\",H8=\"\"),AG1,IF(AND(L9<>\"\",H9=\"\"),AG1,IF(AND(L10<>\"\",H10=\"\"),AG1,\"Eingabe o.k.\"))))))","v":"Eingabe o.k."}]
[39,39,null,null,null,999]
[40,40,null,null,null,999]
[41,41,null,null,null,999]
[42,42,null,null,null,999]
[43,43,null,null,null,999]
[44,44,null,null,null,999]
[45,45,null,null,null,999]
[46,46,null,null,null,999]
[47,47,null,null,null,999]
[48,48,null,null,null,999]
[49,49,null,null,null,999]
[50,50,null,null,null,999]
[51,51,null,null,null,999]
[52,52,null,null,null,999]
[53,53,null,null,null,999]
[54,54,null,null,null,999]
[55,55,null,null,null,999]
[56,56,null,null,null,999]
[57,57,null,null,null,999]
[58,58,null,null,null,999]
[59,59,null,null,null,999]
[60,60,null,null,null,999]
[61,61,null,null,null,999]
[62,62,null,null,null,999]
[63,63,null,null,null,999]
[64,64,null,null,null,999]
[65,{"$f":"IF(A67>0,A67,999)","v":65},null,null,null,{"$f":"IF(G67>0,G67,999)","v":999}]
[66,66,null,null,null,999]
[67,67,null,null,null,999]
[68,68,null,null,null,999]
[69,69,null,null,null,999]
[70,70,null,null,null,999]
[71,71,null,null,null,999]
[72,72,null,null,null,999]
[73,73,null,null,null,999]
[74,74,null,null,null,999]
[75,75,null,null,null,999]
[76,76,null,null,null,999]
[77,77,null,null,null,999]
[78,78,null,null,null,999]
[79,79,null,null,null,999]
[80,80,null,null,null,999]
[81,81,null,null,null,999]
[82,82,null,null,null,999]
[83,83,null,null,null,999]
[84,84,null,null,null,999]
[85,85,null,null,null,999]
[86,86,null,null,null,999]
[87,87,null,null,null,999]
[88,88,null,null,null,999]
[89,89,null,null,null,999]
[90,90,null,null,null,999]
[91,91,null,null,null,999]
[92,92,null,null,null,999]
[93,93,null,null,null,999]
[94,94,null,null,null,999]
[95,95,null,null,null,999]
[96,96,null,null,null,999]
[97,97,null,null,null,{"$f":"IF(G99>0,G99,999)","v":999}]
[98,98,null,null,null,999]
[99,99,null,null,null,999]
[100,100,null,null,null,999]
[101,101,null,null,null,999]
[102,102,null,null,null,999]
[103,103,null,null,null,999]
[104,104,null,null,null,999]
[105,105,null,null,null,999]
[106,106,null,null,null,999]
[107,107,null,null,null,999]
[108,108,null,null,null,999]
[109,109,null,null,null,999]
[110,110,null,null,null,999]
[111,111,null,null,null,999]
[112,112,null,null,null,999]
[113,113,null,null,null,999]
[114,114,null,null,null,999]
[115,115,null,null,null,999]
[116,116,null,null,null,999]
[117,117,null,null,null,999]
[118,118,null,null,null,999]
[119,119,null,null,null,999]
[120,120,null,null,null,999]
[121,121,null,null,null,999]
[122,122,null,null,null,999]
[123,123,null,null,null,999]
[124,124,null,null,null,999]
[125,125,null,null,null,999]
[126,126,null,null,null,999]

{"sheet":"Auswertung Runde 5","index":15,"n_rows":5,"n_cols":3,"rows_kept":5,"cut":false,"hidden":true,"merged":[]}
["Vorname","Name","Alter"]
["Test24","24",123]
["Test15","15",114]
["Test17","17",116]
["Test60","60",159]

{"sheet":"Teilnehmer 6.Runde","index":16,"n_rows":132,"n_cols":7,"rows_kept":132,"cut":false,"hidden":true,"merged":[]}
[]
[]
[]
[]
[]
[null,null,null,"Nr.:","Vorname","Name","Alter"]
[null,{"$f":"RAND()","v":0.1715753060725822},{"$f":"RANK(B7,$B$7:$B$91)","v":71},null,"Test24","24",123]
[null,0.6007061381513108,36,null,"Test15","15",114]
[null,0.81917577465113744,14,null,"Test17","17",116]
[null,0.51363726632742868,42,null,"Test60","60",159]
[null,0.76307877407528779,21]
[null,0.54524034681268774,41]
[null,0.96110057709253682,1]
[null,0.62064081667647497,34]
[null,9.0028130642523241E-3,85]
[null,0.48013544226995875,43]
[null,0.1373083617016293,73]
[null,0.42191612614257901,47]
[null,0.20760255188238053,68]
[null,0.54858874337194097,40]
[null,0.5618972851886036,39]
[null,0.37218823737739437,53]
[null,0.81481851531148031,15]
[null,0.76488915419568859,20]
[null,8.1985280657671522E-2,78]
[null,0.94180296246995976,2]
[null,0.7898897414938052,18]
[null,0.34572415602580342,58]
[null,2.6918988229762131E-2,83]
[null,0.22479849631259785,67]
[null,0.12999172111050039,74]
[null,6.2554372427660265E-2,80]
[null,0.81148050914775449,16]
[null,0.16483501253715838,72]
[null,0.35894418220086421,55]
[null,0.69808151441342359,28]
[null,0.62324776238690938,33]
[null,8.0217508322559139E-2,79]
[null,0.39878846110860766,{"$f":"RANK(B39,$B$7:$B$91)","v":50}]
[null,0.17542799434858602,70]
[null,0.29353612159238007,63]
[null,1.8378072510676691E-2,84]
[null,0.89707463264978415,6]
[null,0.87468100990319964,9]
[null,0.72621795300218428,24]
[null,0.87563160342096036,8]
[null,0.57994296827397351,38]
[null,0.73788910407212915,23]
[null,0.7433457200856346,22]
[null,0.72165944153057027,25]
[null,0.41985192279976336,48]
[null,0.82348262339667599,13]
[null,0.30564846591654282,62]
[null,0.87839209024136589,7]
[null,0.32064993848616619,61]
[null,0.77938624010241808,19]
[null,0.61320282466948095,35]
[null,0.59224892765468762,37]
[null,0.93300523222476384,4]
[null,0.3240066539491756,60]
[null,0.62412823433275522,32]
[null,0.36814032556351928,54]
[null,9.7639340516810891E-2,75]
[null,0.93579484086801989,3]
[null,0.71250441357859318,26]
[null,0.47767248709716092,44]
[null,3.4159084469179035E-2,82]
[null,0.25637949113715397,65]
[null,0.69639090640903545,29]
[null,4.5027111166871747E-2,81]
[null,{"$f":"RAND()","v":0.86212923602710723},{"$f":"RANK(B71,$B$7:$B$91)","v":10}]
[null,0.92320378048872354,5]
[null,0.70149360906374902,27]
[null,0.44082629263783057,46]
[null,0.79249760936941371,17]
[null,0.38980815380482015,52]
[null,0.3477505093772022,57]
[null,0.82616350038788822,12]
[null,0.68459729828241622,30]
[null,0.33596621855509701,59]
[null,0.83963426740070757,11]
[null,0.38999029268063323,51]
[null,0.65577224394067701,31]
[null,0.40225013914369678,49]
[null,0.46874690369125072,45]
[null,9.6905761216319108E-2,76]
[null,0.24015780005974952,66]
[null,0.34831139087561713,56]
[null,0.25811540924774001,64]
[null,0.18351323032658062,69]
[null,9.4450388086006365E-2,77]
[null,0.93434034449684944]
[null,0.58392317318217235]
[null,0.84370007143074954]
[null,0.15584862380896014]
[null,0.5188130019536652]
[null,0.14671845936292705]
[null,0.11993216362669945]
[null,0.97715176172845297]
[null,0.6384343127677663]
[null,0.10672485876344684]
[null,0.10207308482772137]
[null,0.19950036880776134]
[null,0.66318298816149723]
[null,5.9428970781778001E-2]
[null,0.96338624698716468]
[null,0.3170085914801235]
[null,2.4146671145473975E-2]
[null,0.56809272067143501]
[null,0.20017789659224594]
[null,0.55401652310569327]
[null,0.1104579068782372]
[null,0.70573679425288938]
[null,0.99869495852652757]
[null,0.65940124013471657]
[null,0.69537785167454425]
[null,0.45072666348909662]
[null,0.88901517501940364]
[null,0.79621966352322937]
[null,0.56116623174513325]
[null,0.16752549340635881]
[null,0.28409596316898467]
[null,0.45226377908351534]
[null,0.37839652047603722]
[null,0.15086453273435163]
[null,0.3927863135624764]
[null,2.3378819583756649E-2]
[null,0.30857429512819579]
[{"$f":"IF(F129>\"\",B129,IF(G129>\"\",B129,\"\"))","v":""},0.12943412034799473]
[null,0.82727460539569775]
[null,0.26319583470937313]
[null,1.004458039941758E-3]

{"sheet":"Runde 6","index":17,"n_rows":128,"n_cols":21,"rows_kept":128,"cut":false,"hidden":false,"merged":[[1,15,2,19]]}
[]
[null,null,null,null,null,null,null,"Vorname","Name","Alter","Platzierung","Punkte",null,null,null,"Finale"]
[1,{"$f":"IF(A3>0,A3,999)","v":1},null,null,null,{"$f":"IF(G3>0,G3,999)","v":999},null,null,null,null,{"$f":"IF(T5=\"\",\"\",T5)","v":""},{"$f":"IF(S5=\"\",\"\",S5)","v":""}]
[2,2,null,null,null,999,null,null,null,null,{"$f":"IF(T6=\"\",\"\",T6)","v":""},{"$f":"IF(S6=\"\",\"\",S6)","v":""},null,null,null,"Vorname","Name","Alter","Punkte","Platzierung"]
[3,3,null,null,null,999,null,null,null,null,{"$f":"IF(T7=\"\",\"\",T7)","v":""},{"$f":"IF(S7=\"\",\"\",S7)","v":""},null,1,null,{"$f":"IF(H3=\"\",\"\",VLOOKUP(N5,$A$3:$J$132,8,0))","v":""},{"$f":"IF(I3=\"\",\"\",VLOOKUP(N5,$A$3:$J$132,9,0))","v":""},{"$f":"IF(J3=\"\",\"\",VLOOKUP(N5,$A$3:$J$132,10,0))","v":""},null,{"$f":"IFERROR(IF(S5=\"\",\"\",RANK(S5,$S$5:$S$8)),0)","v":""},{"$f":"IF(P5<>\"\",1,\"\")","v":""}]
[4,4,null,null,null,999,null,null,null,null,{"$f":"IF(T8=\"\",\"\",T8)","v":""},{"$f":"IF(S8=\"\",\"\",S8)","v":""},null,2,null,{"$f":"IF(H4=\"\",\"\",VLOOKUP(N6,$A$3:$J$132,8,0))","v":""},{"$f":"IF(I4=\"\",\"\",VLOOKUP(N6,$A$3:$J$132,9,0))","v":""},{"$f":"IF(J4=\"\",\"\",VLOOKUP(N6,$A$3:$J$132,10,0))","v":""},null,{"$f":"IFERROR(IF(S6=\"\",\"\",RANK(S6,$S$5:$S$8)),0)","v":""}]
[5,5,null,null,null,999,null,null,null,null,null,null,null,3,null,{"$f":"IF(H5=\"\",\"\",VLOOKUP(N7,$A$3:$J$132,8,0))","v":""},{"$f":"IF(I5=\"\",\"\",VLOOKUP(N7,$A$3:$J$132,9,0))","v":""},{"$f":"IF(J5=\"\",\"\",VLOOKUP(N7,$A$3:$J$132,10,0))","v":""},null,{"$f":"IFERROR(IF(S7=\"\",\"\",RANK(S7,$S$5:$S$8)),0)","v":""}]
[6,6,null,null,null,999,null,null,null,null,null,null,null,4,null,{"$f":"IF(H6=\"\",\"\",VLOOKUP(N8,$A$3:$J$132,8,0))","v":""},{"$f":"IF(I6=\"\",\"\",VLOOKUP(N8,$A$3:$J$132,9,0))","v":""},{"$f":"IF(J6=\"\",\"\",VLOOKUP(N8,$A$3:$J$132,10,0))","v":""},null,{"$f":"IFERROR(IF(S8=\"\",\"\",RANK(S8,$S$5:$S$8)),0)","v":""}]
[7,7,null,null,null,999]
[8,8,null,null,null,999]
[9,9,null,null,null,999]
[10,10,null,null,null,999]
[11,11,null,null,null,999]
[12,12,null,null,null,999,null,null,null,null,null,null,null,5]
[13,13,null,null,null,999,null,null,null,null,null,null,null,6]
[14,14,null,null,null,999,null,null,null,null,null,null,null,7]
[15,15,null,null,null,999,null,null,null,null,null,null,null,8]
[16,16,null,null,null,999]
[17,17,null,null,null,999]
[18,18,null,null,null,999]
[19,19,null,null,null,999]
[20,20,null,null,null,999]
[21,21,null,null,null,999,null,null,null,null,null,null,null,9]
[22,22,null,null,null,999,null,null,null,null,null,null,null,10]
[23,23,null,null,null,999,null,null,null,null,null,null,null,11]
[24,24,null,null,null,999,null,null,null,null,null,null,null,12]
[25,25,null,null,null,999]
[26,26,null,null,null,999]
[27,27,null,null,null,999]
[28,28,null,null,null,999]
[29,29,null,null,null,999]
[30,30,null,null,null,999,null,null,null,null,null,null,null,13]
[31,31,null,null,null,999,null,null,null,null,null,null,null,14]
[32,32,null,null,null,999,null,null,null,null,null,null,null,15]
[33,33,null,null,null,{"$f":"IF(G35>0,G35,999)","v":999},null,null,null,null,null,null,null,16]
[34,34,null,null,null,999]
[35,35,null,null,null,999]
[36,36,null,null,null,999]
[37,37,null,null,null,999]
[38,38,null,null,null,999]
[39,39,null,null,null,999]
[40,40,null,null,null,999]
[41,41,null,null,null,999]
[42,42,null,null,null,999]
[43,43,null,null,null,999]
[44,44,null,null,null,999]
[45,45,null,null,null,999]
[46,46,null,null,null,999]
[47,47,null,null,null,999]
[48,48,null,null,null,999]
[49,49,null,null,null,999]
[50,50,null,null,null,999]
[51,51,null,null,null,999]
[52,52,null,null,null,999]
[53,53,null,null,null,999]
[54,54,null,null,null,999]
[55,55,null,null,null,999]
[56,56,null,null,null,999]
[57,57,null,null,null,999]
[58,58,null,null,null,999]
[59,59,null,null,null,999]
[60,60,null,null,null,999]
[61,61,null,null,null,999]
[62,62,null,null,null,999]
[63,63,null,null,null,999]
[64,64,null,null,null,999]
[65,{"$f":"IF(A67>0,A67,999)","v":65},null,null,null,{"$f":"IF(G67>0,G67,999)","v":999}]
[66,66,null,null,null,999]
[67,67,null,null,null,999]
[68,68,null,null,null,999]
[69,69,null,null,null,999]
[70,70,null,null,null,999]
[71,71,null,null,null,999]
[72,72,null,null,null,999]
[73,73,null,null,null,999]
[74,74,null,null,null,999]
[75,75,null,null,null,999]
[76,76,null,null,null,999]
[77,77,null,null,null,999]
[78,78,null,null,null,999]
[79,79,null,null,null,999]
[80,80,null,null,null,999]
[81,81,null,null,null,999]
[82,82,null,null,null,999]
[83,83,null,null,null,999]
[84,84,null,null,null,999]
[85,85,null,null,null,999]
[86,86,null,null,null,999]
[87,87,null,null,null,999]
[88,88,null,null,null,999]
[89,89,null,null,null,999]
[90,90,null,null,null,999]
[91,91,null,null,null,999]
[92,92,null,null,null,999]
[93,93,null,null,null,999]
[94,94,null,null,null,999]
[95,95,null,null,null,999]
[96,96,null,null,null,999]
[97,97,null,null,null,{"$f":"IF(G99>0,G99,999)","v":999}]
[98,98,null,null,null,999]
[99,99,null,null,null,999]
[100,100,null,null,null,999]
[101,101,null,null,null,999]
[102,102,null,null,null,999]
[103,103,null,null,null,999]
[104,104,null,null,null,999]
[105,105,null,null,null,999]
[106,106,null,null,null,999]
[107,107,null,null,null,999]
[108,108,null,null,null,999]
[109,109,null,null,null,999]
[110,110,null,null,null,999]
[111,111,null,null,null,999]
[112,112,null,null,null,999]
[113,113,null,null,null,999]
[114,114,null,null,null,999]
[115,115,null,null,null,999]
[116,116,null,null,null,999]
[117,117,null,null,null,999]
[118,118,null,null,null,999]
[119,119,null,null,null,999]
[120,120,null,null,null,999]
[121,121,null,null,null,999]
[122,122,null,null,null,999]
[123,123,null,null,null,999]
[124,124,null,null,null,999]
[125,125,null,null,null,999]
[126,126,null,null,null,999]

{"sheet":"Kopie Teilnehmer Erfassung","index":18,"n_rows":106,"n_cols":26,"rows_kept":106,"cut":false,"hidden":true,"merged":[]}
[null,null,null,null,null,null,null,null,null,null,"1.Runde",null,null,"2.Runde",null,null,"3.Runde",null,null,"4.Runde",null,null,"5.Runde",null,null,"6.Runde"]
[null,null,null,null,null,null,null,null,null,"Teilnehmer:",{"$f":"IF(J11=\"\",4,IF(J15=\"\",8,IF(J19=\"\",12,IF(J23=\"\",16,IF(J27=\"\",20,IF(J31=\"\",24,IF(J35=\"\",28,IF(J39=\"\",32,IF(J43=\"\",36,IF(J47=\"\",40,IF(J51=\"\",44,IF(J55=\"\",48,IF(J59=\"\",52,IF(J63=\"\",56,IF(J67=\"\",60,IF(J71=\"\",64,IF(J75=\"\",68,IF(J79=\"\",72,IF(J83=\"\",76,IF(J87=\"\",80,IF(J91=\"\",84,IF(J95=\"\",88,IF(J99=\"\",92,IF(J103=\"\",96,100))))))))))))))))))))))))","v":4},{"$f":"ROUNDUP(K2/4,0)","v":1},{"$f":"L2/2","v":0.5},{"$f":"IF(K2<=4,0,ROUNDUP(M2,0)*4)","v":0},{"$f":"ROUNDUP(N2/4,0)","v":0},{"$f":"O2/2","v":0},{"$f":"IF(N2<=4,\"\",ROUNDUP(P2,0)*4)","v":""},{"$f":"ROUNDUP(Q2/4,0)","v":{"$error":"#VALUE!"}},{"$f":"R2/2","v":{"$error":"#VALUE!"}},{"$f":"IF(Q2<=4,\"\",ROUNDUP(S2,0)*4)","v":{"$error":"#VALUE!"}},{"$f":"ROUNDUP(T2/4,0)","v":{"$error":"#VALUE!"}},{"$f":"U2/2","v":{"$error":"#VALUE!"}},{"$f":"IF(T2<=4,\"\",ROUNDUP(V2,0)*4)","v":{"$error":"#VALUE!"}},{"$f":"ROUNDUP(W2/4,0)","v":{"$error":"#VALUE!"}},{"$f":"SUM(X2/2)","v":{"$error":"#VALUE!"}},{"$f":"IF(W2<=4,\"\",ROUNDUP(Y2,0)*4)","v":{"$error":"#VALUE!"}}]
[null,null,null,null,null,null,null,null,null,"Die Teilnehmerzahl in der Ersten Runde sollte immer durch 4 teilbar sein. Anwendung nur für max 100 Spieler."]
[null,null,null,null,null,null,null,null,null,"In der Teilnehmerlisten werden ggf. 3 Pseudo-Namen eingetragen"]
[]
[null,null,"Nr.:",null,null,null,null,null,"Nr.:","Vorname","Name",null,null,"Alter",null,null,"E-Mail Adresse"]
[{"$f":"RAND()","v":1.1096264122444688E-2},{"$f":"RANK(A7,$A$7:$A$106)","v":99},{"$f":"B7","v":99},null,null,null,null,null,1]
[{"$f":"RAND()","v":0.29297871812344534},62,{"$f":"B8","v":62},null,null,null,null,null,2]
[0.37652348924943035,50,50,null,null,null,null,null,3]
[0.26223043775801236,70,70,null,null,null,null,null,4]
[0.9171442371834212,7,7,null,null,null,null,null,5]
[0.91497418013862597,8,8,null,null,null,null,null,6]
[0.45027834961265722,46,46,null,null,null,null,null,7]
[0.34850137102448897,58,58,null,null,null,null,null,8]
[0.92521145249724046,4,4,null,null,null,null,null,9]
[0.27759316839460579,67,67,null,null,null,null,null,10]
[0.66454767020809036,27,27,null,null,null,null,null,11]
[0.99542182715583338,1,1,null,null,null,null,null,12]
[0.22748759556316034,76,76,null,null,null,null,null,13]
[0.10007426148849896,90,90,null,null,null,null,null,14]
[0.32197543541660989,61,61,null,null,null,null,null,15]
[0.76071378405928769,17,17,null,null,null,null,null,16]
[0.1212088648189511,86,86,null,null,null,null,null,17]
[0.80930202723758016,14,14,null,null,null,null,null,18]
[9.4260047294121296E-3,100,100,null,null,null,null,null,19]
[6.3287794261354335E-2,94,94,null,null,null,null,null,20]
[0.73660135753158329,22,22,null,null,null,null,null,21]
[0.14809446970173934,82,82,null,null,null,null,null,22]
[0.50890029191298314,41,41,null,null,null,null,null,23]
[0.87680706594672808,11,11,null,null,null,null,null,24]
[0.35844439845236242,54,54,null,null,null,null,null,25]
[0.51173674487897858,40,40,null,null,null,null,null,26]
[9.7148833670904433E-2,91,91,null,null,null,null,null,27]
[0.25887603278109106,72,72,null,null,null,null,null,28]
[0.28153918685272361,66,66,null,null,null,null,null,29]
[0.65339402379436673,30,30,null,null,null,null,null,30]
[0.406751480856126,49,49,null,null,null,null,null,31]
[0.49717836399977111,42,42,null,null,null,null,null,32]
[0.426390760736861,48,48,null,null,null,null,null,33]
[0.27418995476928487,68,68,null,null,null,null,null,34]
[0.75225294514699981,18,18,null,null,null,null,null,35]
[0.3580573621214983,55,55,null,null,null,null,null,36]
[0.88811132871168985,10,10,null,null,null,null,null,37]
[0.36962550173714248,53,53,null,null,null,null,null,38]
[0.26203456740994824,71,71,null,null,null,null,null,39]
[0.84568899750980686,13,13,null,null,null,null,null,40]
[0.45849841972342986,45,45,null,null,null,null,null,41]
[0.55381549613176539,36,36,null,null,null,null,null,42]
[4.2835902721404917E-2,97,97,null,null,null,null,null,43]
[0.12369327841846312,85,85,null,null,null,null,null,44]
[0.11557989532619695,88,88,null,null,null,null,null,45]
[0.49289004658916002,43,43,null,null,null,null,null,46]
[0.73987952990723316,21,21,null,null,null,null,null,47]
[0.92267324593939504,6,6,null,null,null,null,null,48]
[0.84652494390930144,12,12,null,null,null,null,null,49]
[0.78679464796617837,15,15,null,null,null,null,null,50]
[0.60732056163544912,33,33,null,null,null,null,null,51]
[4.9686757072747501E-2,96,96,null,null,null,null,null,52]
[0.25566029623137732,74,74,null,null,null,null,null,53]
[0.29000505381519004,63,63,null,null,null,null,null,54]
[0.52098364562054233,38,38,null,null,null,null,null,55]
[0.44244605031759909,47,47,null,null,null,null,null,56]
[0.74590289676657262,19,19,null,null,null,null,null,57]
[0.55033403238066225,37,37,null,null,null,null,null,58]
[0.72643255081411129,23,23,null,null,null,null,null,59]
[0.3763080175468263,51,51,null,null,null,null,null,60]
[0.22386255626403539,77,77,null,null,null,null,null,61]
[0.7630058553231629,16,16,null,null,null,null,null,62]
[0.61241449975604867,32,32,null,null,null,null,null,63]
[0.12116472220417374,87,87,null,null,null,null,null,64]
[0.57406536874094594,{"$f":"RANK(A71,$A$7:$A$106)","v":34},34,null,null,null,null,null,65]
[{"$f":"RAND()","v":0.1600164115270919},79,{"$f":"B72","v":79},null,null,null,null,null,66]
[0.89524769194763865,9,9,null,null,null,null,null,67]
[0.20108989065078231,78,78,null,null,null,null,null,68]
[0.14605482528316915,83,83,null,null,null,null,null,69]
[0.34698444955349084,60,60,null,null,null,null,null,70]
[0.27251161983782957,69,69,null,null,null,null,null,71]
[0.14960949697932868,81,81,null,null,null,null,null,72]
[0.66077079648386561,29,29,null,null,null,null,null,73]
[0.34801487812199128,59,59,null,null,null,null,null,74]
[9.5712971539981262E-2,92,92,null,null,null,null,null,75]
[0.28857995962111083,64,64,null,null,null,null,null,76]
[0.94777868505474661,3,3,null,null,null,null,null,77]
[0.98358403198953304,2,2,null,null,null,null,null,78]
[0.67621573834867488,25,25,null,null,null,null,null,79]
[0.66442395526140585,28,28,null,null,null,null,null,80]
[0.92384379940592964,5,5,null,null,null,null,null,81]
[0.13303896089713452,84,84,null,null,null,null,null,82]
[0.35254527084297815,57,57,null,null,null,null,null,83]
[0.37055080738781065,52,52,null,null,null,null,null,84]
[0.51240838379595899,39,39,null,null,null,null,null,85]
[0.64651421569718837,31,31,null,null,null,null,null,86]
[0.28828703999430327,65,65,null,null,null,null,null,87]
[0.35490827026056793,56,56,null,null,null,null,null,88]
[0.25839210413097191,73,73,null,null,null,null,null,89]
[0.6853916710437834,24,24,null,null,null,null,null,90]
[7.9594164515038646E-2,93,93,null,null,null,null,null,91]
[0.743647494218174,20,20,null,null,null,null,null,92]
[0.6702474437900674,26,26,null,null,null,null,null,93]
[0.48497399758578164,44,44,null,null,null,null,null,94]
[5.6715011483434385E-2,95,95,null,null,null,null,null,95]
[0.15918279771813093,80,80,null,null,null,null,null,96]
[0.10283568606936067,89,89,null,null,null,null,null,97]
[0.24698400104383122,75,75,null,null,null,null,null,98]
[0.5736573930635257,35,35,null,null,null,null,null,99]
[3.5347355772312516E-2,98,98,null,null,null,null,null,100]

{"sheet":"Finale Kinder unter 13 Jahren","index":19,"n_rows":124,"n_cols":14,"rows_kept":124,"cut":false,"hidden":false,"merged":[]}
[]
[]
[]
[]
[null,null,null,null,null,null,null,null,null,null,null,null,null,{"$f":"IF(#REF!=\"\",0,1)","v":{"$error":"#REF!"}}]
[]
[{"$f":"IF(G7=\"\",\"\",G7)","v":""}]
[""]
[""]
[""]
[""]
[""]
[""]
[""]
[""]
[""]
[""]
[""]
[""]
[""]
[""]
[{"$f":"IF(D22>'Teilnehmer Erfassung'!$AA$3,\"x\",\"\")","v":""}]
[{"$f":"IF(D23>'Teilnehmer Erfassung'!$AA$3,\"x\",\"\")","v":""}]
[{"$f":"IF(D24>'Teilnehmer Erfassung'!$AA$3,\"x\",\"\")","v":""}]
[{"$f":"IF(D25>'Teilnehmer Erfassung'!$AA$3,\"x\",\"\")","v":""}]
[{"$f":"IF(D26>'Teilnehmer Erfassung'!$AA$3,\"x\",\"\")","v":""}]
[{"$f":"IF(D27>'Teilnehmer Erfassung'!$AA$3,\"x\",\"\")","v":""}]
[{"$f":"IF(D28>'Teilnehmer Erfassung'!$AA$3,\"x\",\"\")","v":""}]
[{"$f":"IF(D29>'Teilnehmer Erfassung'!$AA$3,\"x\",\"\")","v":""}]
[{"$f":"IF(D30>'Teilnehmer Erfassung'!$AA$3,\"x\",\"\")","v":""}]
[{"$f":"IF(D31>'Teilnehmer Erfassung'!$AA$3,\"x\",\"\")","v":""}]
[{"$f":"IF(D32>'Teilnehmer Erfassung'!$AA$3,\"x\",\"\")","v":""}]
[{"$f":"IF(D33>'Teilnehmer Erfassung'!$AA$3,\"x\",\"\")","v":""}]
[{"$f":"IF(D34>'Teilnehmer Erfassung'!$AA$3,\"x\",\"\")","v":""}]
[{"$f":"IF(D35>'Teilnehmer Erfassung'!$AA$3,\"x\",\"\")","v":""}]
[{"$f":"IF(D36>'Teilnehmer Erfassung'!$AA$3,\"x\",\"\")","v":""}]
[{"$f":"IF(D37>'Teilnehmer Erfassung'!$AA$3,\"x\",\"\")","v":""}]
[{"$f":"IF(D38>'Teilnehmer Erfassung'!$AA$3,\"x\",\"\")","v":""}]
[{"$f":"IF(D39>'Teilnehmer Erfassung'!$AA$3,\"x\",\"\")","v":""}]
[{"$f":"IF(D40>'Teilnehmer Erfassung'!$AA$3,\"x\",\"\")","v":""}]
[{"$f":"IF(D41>'Teilnehmer Erfassung'!$AA$3,\"x\",\"\")","v":""}]
[{"$f":"IF(D42>'Teilnehmer Erfassung'!$AA$3,\"x\",\"\")","v":""}]
[{"$f":"IF(D43>'Teilnehmer Erfassung'!$AA$3,\"x\",\"\")","v":""}]
[{"$f":"IF(D44>'Teilnehmer Erfassung'!$AA$3,\"x\",\"\")","v":""}]
[{"$f":"IF(D45>'Teilnehmer Erfassung'!$AA$3,\"x\",\"\")","v":""}]
[{"$f":"IF(D46>'Teilnehmer Erfassung'!$AA$3,\"x\",\"\")","v":""}]
[{"$f":"IF(D47>'Teilnehmer Erfassung'!$AA$3,\"x\",\"\")","v":""}]
[{"$f":"IF(D48>'Teilnehmer Erfassung'!$AA$3,\"x\",\"\")","v":""}]
[{"$f":"IF(D49>'Teilnehmer Erfassung'!$AA$3,\"x\",\"\")","v":""}]
[{"$f":"IF(D50>'Teilnehmer Erfassung'!$AA$3,\"x\",\"\")","v":""}]
[{"$f":"IF(D51>'Teilnehmer Erfassung'!$AA$3,\"x\",\"\")","v":""}]
[{"$f":"IF(D52>'Teilnehmer Erfassung'!$AA$3,\"x\",\"\")","v":""}]
[{"$f":"IF(D53>'Teilnehmer Erfassung'!$AA$3,\"x\",\"\")","v":""}]
[{"$f":"IF(D54>'Teilnehmer Erfassung'!$AA$3,\"x\",\"\")","v":""}]
[{"$f":"IF(D55>'Teilnehmer Erfassung'!$AA$3,\"x\",\"\")","v":""}]
[{"$f":"IF(D56>'Teilnehmer Erfassung'!$AA$3,\"x\",\"\")","v":""}]
[{"$f":"IF(D57>'Teilnehmer Erfassung'!$AA$3,\"x\",\"\")","v":""}]
[{"$f":"IF(D58>'Teilnehmer Erfassung'!$AA$3,\"x\",\"\")","v":""}]
[{"$f":"IF(D59>'Teilnehmer Erfassung'!$AA$3,\"x\",\"\")","v":""}]
[{"$f":"IF(D60>'Teilnehmer Erfassung'!$AA$3,\"x\",\"\")","v":""}]
[{"$f":"IF(D61>'Teilnehmer Erfassung'!$AA$3,\"x\",\"\")","v":""}]
[{"$f":"IF(D62>'Teilnehmer Erfassung'!$AA$3,\"x\",\"\")","v":""}]
[{"$f":"IF(D63>'Teilnehmer Erfassung'!$AA$3,\"x\",\"\")","v":""}]
[{"$f":"IF(D64>'Teilnehmer Erfassung'!$AA$3,\"x\",\"\")","v":""}]
[{"$f":"IF(D65>'Teilnehmer Erfassung'!$AA$3,\"x\",\"\")","v":""}]
[{"$f":"IF(D66>'Teilnehmer Erfassung'!$AA$3,\"x\",\"\")","v":""}]
[{"$f":"IF(D67>'Teilnehmer Erfassung'!$AA$3,\"x\",\"\")","v":""}]
[{"$f":"IF(D68>'Teilnehmer Erfassung'!$AA$3,\"x\",\"\")","v":""}]
[{"$f":"IF(D69>'Teilnehmer Erfassung'!$AA$3,\"x\",\"\")","v":""}]
[{"$f":"IF(D70>'Teilnehmer Erfassung'!$AA$3,\"x\",\"\")","v":""}]
[{"$f":"IF(D71>'Teilnehmer Erfassung'!$AA$3,\"x\",\"\")","v":""}]
[{"$f":"IF(D72>'Teilnehmer Erfassung'!$AA$3,\"x\",\"\")","v":""}]
[{"$f":"IF(D73>'Teilnehmer Erfassung'!$AA$3,\"x\",\"\")","v":""}]
[{"$f":"IF(D74>'Teilnehmer Erfassung'!$AA$3,\"x\",\"\")","v":""}]
[{"$f":"IF(D75>'Teilnehmer Erfassung'!$AA$3,\"x\",\"\")","v":""}]
[{"$f":"IF(D76>'Teilnehmer Erfassung'!$AA$3,\"x\",\"\")","v":""}]
[{"$f":"IF(D77>'Teilnehmer Erfassung'!$AA$3,\"x\",\"\")","v":""}]
[{"$f":"IF(D78>'Teilnehmer Erfassung'!$AA$3,\"x\",\"\")","v":""}]
[{"$f":"IF(D79>'Teilnehmer Erfassung'!$AA$3,\"x\",\"\")","v":""}]
[{"$f":"IF(D80>'Teilnehmer Erfassung'!$AA$3,\"x\",\"\")","v":""}]
[{"$f":"IF(D81>'Teilnehmer Erfassung'!$AA$3,\"x\",\"\")","v":""}]
[{"$f":"IF(D82>'Teilnehmer Erfassung'!$AA$3,\"x\",\"\")","v":""}]
[{"$f":"IF(D83>'Teilnehmer Erfassung'!$AA$3,\"x\",\"\")","v":""}]
[{"$f":"IF(D84>'Teilnehmer Erfassung'!$AA$3,\"x\",\"\")","v":""}]
[{"$f":"IF(D85>'Teilnehmer Erfassung'!$AA$3,\"x\",\"\")","v":""}]
[{"$f":"IF(D86>'Teilnehmer Erfassung'!$AA$3,\"x\",\"\")","v":""}]
[{"$f":"IF(D87>'Teilnehmer Erfassung'!$AA$3,\"x\",\"\")","v":""}]
[{"$f":"IF(D88>'Teilnehmer Erfassung'!$AA$3,\"x\",\"\")","v":""}]
[{"$f":"IF(D89>'Teilnehmer Erfassung'!$AA$3,\"x\",\"\")","v":""}]
[{"$f":"IF(D90>'Teilnehmer Erfassung'!$AA$3,\"x\",\"\")","v":""}]
[{"$f":"IF(D91>'Teilnehmer Erfassung'!$AA$3,\"x\",\"\")","v":""}]
[{"$f":"IF(D92>'Teilnehmer Erfassung'!$AA$3,\"x\",\"\")","v":""}]
[{"$f":"IF(D93>'Teilnehmer Erfassung'!$AA$3,\"x\",\"\")","v":""}]
[{"$f":"IF(D94>'Teilnehmer Erfassung'!$AA$3,\"x\",\"\")","v":""}]
[{"$f":"IF(D95>'Teilnehmer Erfassung'!$AA$3,\"x\",\"\")","v":""}]
[{"$f":"IF(D96>'Teilnehmer Erfassung'!$AA$3,\"x\",\"\")","v":""}]
[{"$f":"IF(D97>'Teilnehmer Erfassung'!$AA$3,\"x\",\"\")","v":""}]
[{"$f":"IF(D98>'Teilnehmer Erfassung'!$AA$3,\"x\",\"\")","v":""}]
[{"$f":"IF(D99>'Teilnehmer Erfassung'!$AA$3,\"x\",\"\")","v":""}]
[{"$f":"IF(D100>'Teilnehmer Erfassung'!$AA$3,\"x\",\"\")","v":""}]
[{"$f":"IF(D101>'Teilnehmer Erfassung'!$AA$3,\"x\",\"\")","v":""}]
[{"$f":"IF(D102>'Teilnehmer Erfassung'!$AA$3,\"x\",\"\")","v":""}]
[{"$f":"IF(D103>'Teilnehmer Erfassung'!$AA$3,\"x\",\"\")","v":""}]
[{"$f":"IF(D104>'Teilnehmer Erfassung'!$AA$3,\"x\",\"\")","v":""}]
[{"$f":"IF(D105>'Teilnehmer Erfassung'!$AA$3,\"x\",\"\")","v":""}]
[{"$f":"IF(D106>'Teilnehmer Erfassung'!$AA$3,\"x\",\"\")","v":""}]
[{"$f":"IF(D107>'Teilnehmer Erfassung'!$AA$3,\"x\",\"\")","v":""}]
[{"$f":"IF(D108>'Teilnehmer Erfassung'!$AA$3,\"x\",\"\")","v":""}]
[{"$f":"IF(D109>'Teilnehmer Erfassung'!$AA$3,\"x\",\"\")","v":""}]
[{"$f":"IF(D110>'Teilnehmer Erfassung'!$AA$3,\"x\",\"\")","v":""}]
[{"$f":"IF(D111>'Teilnehmer Erfassung'!$AA$3,\"x\",\"\")","v":""}]
[{"$f":"IF(D112>'Teilnehmer Erfassung'!$AA$3,\"x\",\"\")","v":""}]
[{"$f":"IF(D113>'Teilnehmer Erfassung'!$AA$3,\"x\",\"\")","v":""}]
[{"$f":"IF(D114>'Teilnehmer Erfassung'!$AA$3,\"x\",\"\")","v":""}]
[{"$f":"IF(D115>'Teilnehmer Erfassung'!$AA$3,\"x\",\"\")","v":""}]
[{"$f":"IF(D116>'Teilnehmer Erfassung'!$AA$3,\"x\",\"\")","v":""}]
[{"$f":"IF(D117>'Teilnehmer Erfassung'!$AA$3,\"x\",\"\")","v":""}]
[{"$f":"IF(D118>'Teilnehmer Erfassung'!$AA$3,\"x\",\"\")","v":""}]
[{"$f":"IF(D119>'Teilnehmer Erfassung'!$AA$3,\"x\",\"\")","v":""}]
[{"$f":"IF(D120>'Teilnehmer Erfassung'!$AA$3,\"x\",\"\")","v":""}]
[{"$f":"IF(D121>'Teilnehmer Erfassung'!$AA$3,\"x\",\"\")","v":""}]
[{"$f":"IF(D122>'Teilnehmer Erfassung'!$AA$3,\"x\",\"\")","v":""}]
[{"$f":"IF(D123>'Teilnehmer Erfassung'!$AA$3,\"x\",\"\")","v":""}]
[{"$f":"IF(D124>'Teilnehmer Erfassung'!$AA$3,\"x\",\"\")","v":""}]